{"text_format":"1","workbook":"xlsx","n_sheets":4,"sheets":["Main","Baza","GAMAT","Drukuj"],"not_rendered":{"charts":0,"images":5,"macros":1,"external_links":0,"defined_names":3,"comments":0,"pivot_tables":0},"unopened":[],"bounds":{"document_bytes":16777216,"sheet_cells":100000,"rows_first":2000,"rows_last":500,"rows_between":2000,"halvings":0,"cell_chars":16384,"cell_head_chars":4096},"cells_cut":0,"cells_raw":0,"read":"whole","date_system":"1900"}

{"sheet":"Main","index":0,"n_rows":19,"n_cols":14,"rows_kept":19,"cut":false,"hidden":true,"merged":[[1,1,3,1],[6,2,6,4],[6,5,6,8],[10,2,10,4],[5,2,5,8],[9,1,11,1],[5,1,7,1],[2,2,2,4],[2,5,2,8],[3,5,3,8],[1,2,1,8],[3,2,3,4],[11,2,11,4],[10,5,10,8],[11,5,11,8],[7,5,7,8],[7,2,7,4],[9,2,9,8],[13,1,15,1],[13,2,13,8],[14,2,14,4],[14,5,14,8],[15,2,15,4],[15,5,15,8]]}
[]
[null,null,"Dostawa"]
[null,null,"Opłata",null,null,11]
[null,null,"Darmowa dostawa",null,null,300]
[]
[null,null,"Upominek"]
[null,null,"Nazwa upominku",null,null,"Kolekcja czekoladek Merci Finest 250g"]
[null,null,"Od jakiej wartości",null,null,500]
[]
[null,null,"Czas dostawy (dni robocze)"]
[null,null,"Warszawa",null,null,1]
[null,null,"Poza Warszawą",null,null,2]
[]
[null,null,"Płatność",null,null,null,null,null,null,null,null,null,"Warszawa","Poza Warszawą"]
[null,null,"Warszawa",null,null,null,null,null,null,null,null,"Przelew",true,false]
[null,null,"Poza Warszawą",null,null,null,null,null,null,null,null,"Gotówka",true,false]
[null,null,null,null,null,null,null,null,null,null,null,"Przedpłata",false,true]
[null,"Problemy/Pytania"]
[null,"Drukowanie -> Lp. pozostaje bez zmian. Można to zmienić"]

{"sheet":"Baza","index":1,"n_rows":121,"n_cols":9,"rows_kept":121,"cut":false,"hidden":true,"merged":[]}
[]
[null,"Kategoria","Dział","Symbol","Produkt","Produkt (nazwa bez jednostek)","Pojemność","Cena netto","Cena brutto"]
[null,"Kawa","Rozpuszczalna","gkk0080","Nescafe Gold 200 g","Nescafe Gold","200 g",33.08,40.688399999999994]
[null,"Kawa","Rozpuszczalna","gkk0050","Nescafe Creme Sensazione 200 g","Nescafe Creme Sensazione","200 g",19.88,24.452399999999997]
[null,"Kawa","Rozpuszczalna","gkk0030","Nescafe Classic 200 g","Nescafe Classic","200 g",18.41,22.644300000000001]
[null,"Kawa","Rozpuszczalna","gkk0060","Nescafe Espresso Int. Puszka 100 g","Nescafe Espresso Int. Puszka","100 g",22.45,27.613499999999998]
[null,"Kawa","Rozpuszczalna","gkk0210","Jacobs Cronat Gold 200 g","Jacobs Cronat Gold","200 g",20.329999999999998,25.005899999999997]
[null,"Kawa","Mielona","gkk0200","Tchibo Family Classic 250 g","Tchibo Family Classic","250 g",6,7.38]
[null,"Kawa","Mielona","gkk0140","Lavazza Espresso 250 g","Lavazza Espresso","250 g",63,77.489999999999995]
[null,"Kawa","Mielona","gkk0150","Lavazza Qualita Rossa 250 g","Lavazza Qualita Rossa","250 g",13.69,16.838699999999999]
[null,"Kawa","Mielona","gkk0120","Lavazza Qualita Oro 250 g","Lavazza Qualita Oro","250 g",15.75,19.372499999999999]
[null,"Kawa","Ziarnista","gkk0130","Lavazza Qualita Oro 250 g","Lavazza Qualita Oro","250 g",18.38,22.607399999999998]
[null,"Kawa","Ziarnista","gkk0140","Lavazza Qualita Oro 1000 g","Lavazza Qualita Oro","1000 g",63,77.489999999999995]
[null,"Kawa","Ziarnista","gkk0160","Lavazza Qualita Rossa 1000 g","Lavazza Qualita Rossa","1000 g",47.49,58.412700000000001]
[null,"Kawa","Ziarnista","gkk0180","Lavazza Grand Espresso 1000 g","Lavazza Grand Espresso","1000 g",61.69,75.878699999999995]
[null,"Kawa","Ziarnista","gkk0190","Lavazza Crema e Aroma 1000 g","Lavazza Crema e Aroma","1000 g",47.49,58.412700000000001]
[null,"Herbata","Czarna","ghk0160","Lipton Yellow Label 100 tor.","Lipton Yellow Label","100 tor.",12.19,14.993699999999999]
[null,"Herbata","Czarna","ghk0190","Lipton Earl Grey 100 tor.","Lipton Earl Grey","100 tor.",22.83,28.080899999999996]
[null,"Herbata","Czarna","ghk0250","Lipton Yellow Label 100 kopert","Lipton Yellow Label","100 kopert",35.33,43.4559]
[null,"Herbata","Czarna","ghk0260","Lipton Earl Grey 100 kopert","Lipton Earl Grey","100 kopert",35.049999999999997,43.111499999999992]
[null,"Herbata","Czarna","ghk0400","Saga 50 tor.","Saga","50 tor.",3.28,4.0343999999999998]
[null,"Herbata","Czarna","ghk0410","Saga 100 tor.","Saga","100 tor.",5.94,7.3062000000000005]
[null,"Herbata","Czarna","ghk0040","Dilmah Ceylon Gold 100 tor.","Dilmah Ceylon Gold","100 tor.",23.05,28.351500000000001]
[null,"Herbata","Czarna","ghk0020","Dilmah Premium Tea 100 tor. bez zawieszki","Dilmah Premium Tea bez zawieszki","100 tor.",18.079999999999998,22.238399999999999]
[null,"Herbata","Czarna","ghk0050","Dilmah Earl Grey 100 tor. bez zawieszki","Dilmah Earl Grey bez zawieszki","100 tor.",22.76,27.994800000000001]
[null,"Herbata","Zielona","ghk0200","Lipton miętowa 25 tor.","Lipton miętowa","25 tor.",4.74,5.8302000000000005]
[null,"Herbata","Zielona","ghk0210","Lipton cytrusowa 25 tor.","Lipton cytrusowa","25 tor.",4.6900000000000004,5.7687000000000008]
[null,"Herbata","Zielona","ghk0220","Lipton classic 25 tor.","Lipton classic","25 tor.",4.6900000000000004,5.7687000000000008]
[null,"Herbata","Owocowa","ghk0340","Lipton Piramidka Gold Tea 20 szt","Lipton Piramidka Gold Tea","20 szt.",7.73,9.5079000000000011]
[null,"Herbata","Owocowa","ghk0350","Lipton Piramidka White Raspberry 20 szt","Lipton Piramidka White Raspberry","20 szt.",6.78,8.3393999999999995]
[null,"Herbata","Owocowa","ghk0360","Lipton Piramidka Cytryna 20 szt","Lipton Piramidka Cytryna","20 szt.",6.78,8.3393999999999995]
[null,"Herbata","Owocowa","ghk0370","Lipton Piramidka Owoce Leśne 20 szt","Lipton Piramidka Owoce Leśne","20 szt.",6.78,8.3393999999999995]
[null,"Herbata","Owocowa","ghk0380","Lipton Piramidka Indones Sencha 20 szt","Lipton Piramidka Indones Sencha","20 szt.",7.73,9.5079000000000011]
[null,"Herbata","Owocowa","ghk0390","Lipton Piramidka Zielona Cytryna Melisa 20 szt","Lipton Piramidka Zielona Cytryna Melisa","20 szt.",6.78,8.3393999999999995]
[null,"Herbata","Aromatyzowana","ghk0280","Lipton Green Tea Pure 25 kopert fol.","Lipton Green Tea Pure fol.","25 kopert",10.34,12.7182]
[null,"Herbata","Aromatyzowana","ghk0290","Lipton Green Tea Mint 25 kopert fol.","Lipton Green Tea Mint fol.","25 kopert",10.55,12.976500000000001]
[null,"Herbata","Aromatyzowana","ghk0300","Lipton Green Tea Citrus 25 kopert fol.","Lipton Green Tea Citrus fol.","25 kopert",10.45,12.853499999999999]
[null,"Herbata","Aromatyzowana","ghk0310","Lipton Green Tea Orient 25 kopert fol.","Lipton Green Tea Orient fol.","25 kopert",10.34,12.7182]
[null,"Herbata","Aromatyzowana","ghk0320","Lipton Owocowa Fruit Influsion 25 kopert fol.","Lipton Owocowa Fruit Influsion fol.","25 kopert",11.95,14.698499999999999]
[null,"Herbata","Aromatyzowana","ghk0330","Lipton Vanilia 25 kopert fol.","Lipton Vanilia fol.","25 kopert",10.34,12.7182]
{"$rows_left_out":82}
{"sheet":"GAMAT","index":2,"n_rows":137,"n_cols":17,"rows_kept":137,"cut":false,"hidden":false,"merged":[[7,2,11,2],[12,2,15,2],[16,2,20,2],[21,2,29,2],[30,2,32,2],[33,2,38,2],[7,4,7,5],[8,4,8,5],[7,1,20,1],[21,1,52,1],[39,2,52,2],[13,4,13,5],[14,4,14,5],[15,4,15,5],[16,4,16,5],[17,4,17,5],[18,4,18,5],[19,4,19,5],[20,4,20,5],[21,4,21,5],[32,4,32,5],[33,4,33,5],[40,4,40,5],[41,4,41,5],[53,2,54,2],[55,2,64,2],[65,2,66,2],[67,2,77,2],[78,2,85,2],[86,2,96,2],[53,1,66,1],[67,1,96,1],[97,1,119,1],[129,7,129,10],[130,7,130,9],[131,7,131,10],[127,1,127,6],[128,1,131,6],[97,2,99,2],[100,2,107,2],[108,2,119,2],[120,2,125,2],[127,7,127,9],[128,7,128,9],[123,4,123,5],[124,4,124,5],[125,4,125,5],[115,4,115,5],[120,1,125,1],[120,4,120,5],[121,4,121,5],[122,4,122,5],[119,4,119,5],[118,4,118,5],[117,4,117,5],[116,4,116,5],[105,4,105,5],[6,4,6,5],[9,4,9,5],[10,4,10,5],[11,4,11,5],[12,4,12,5],[28,4,28,5],[29,4,29,5],[30,4,30,5],[31,4,31,5],[22,4,22,5],[23,4,23,5],[24,4,24,5],[25,4,25,5],[26,4,26,5],[27,4,27,5],[42,4,42,5],[43,4,43,5],[44,4,44,5],[45,4,45,5],[34,4,34,5],[35,4,35,5],[36,4,36,5],[37,4,37,5],[38,4,38,5],[39,4,39,5],[52,4,52,5],[53,4,53,5],[54,4,54,5],[55,4,55,5],[56,4,56,5],[57,4,57,5],[46,4,46,5],[47,4,47,5],[48,4,48,5],[49,4,49,5],[50,4,50,5],[51,4,51,5],[58,4,58,5],[59,4,59,5],[60,4,60,5],[61,4,61,5],[62,4,62,5],[63,4,63,5],[114,4,114,5],[113,4,113,5],[112,4,112,5],[111,4,111,5],[110,4,110,5],[109,4,109,5],[64,4,64,5],[65,4,65,5],[66,4,66,5],[102,4,102,5],[101,4,101,5],[100,4,100,5],[99,4,99,5],[98,4,98,5],[97,4,97,5],[108,4,108,5],[107,4,107,5],[106,4,106,5],[104,4,104,5],[103,4,103,5],[69,4,69,5],[70,4,70,5],[71,4,71,5],[96,4,96,5],[95,4,95,5],[94,4,94,5],[93,4,93,5],[92,4,92,5],[91,4,91,5],[2,7,2,8],[84,4,84,5],[85,4,85,5],[136,1,137,10],[3,7,4,8],[78,4,78,5],[79,4,79,5],[80,4,80,5],[81,4,81,5],[82,4,82,5],[83,4,83,5],[72,4,72,5],[73,4,73,5],[74,4,74,5],[75,4,75,5],[76,4,76,5],[77,4,77,5],[90,4,90,5],[89,4,89,5],[88,4,88,5],[87,4,87,5],[86,4,86,5],[67,4,67,5],[68,4,68,5]]}
[]
[null,null,"GAMAT",null,"Dane Zamawiającego",null,null,null,null,null,null,null,null,null,null,{"$f":"IF(F4=\"Warszawa\",IF(Main!M15=TRUE,Main!L15,\"\"),IF(Main!N15=TRUE,Main!L15,\"\"))","v":"Przelew"},1]
[null,null,"www.gamat.pl",null,"NIP",1234567890,"Kod pocztowy",12345,null,null,null,null,null,null,null,{"$f":"IF(F4=\"Warszawa\",IF(Main!M16=TRUE,Main!L16,\"\"),IF(Main!N16=TRUE,Main!L16,\"\"))","v":"Gotówka"}]
[null,null,"gamatsc@gamat.pl",null,"Miejscowość","Warszawa","Adres dostawy","  ",null,null,null,null,null,null,null,{"$f":"IF(F4=\"Warszawa\",IF(Main!M17=TRUE,Main!L17,\"\"),IF(Main!N17=TRUE,Main!L17,\"\"))","v":""}]
[null,null,"tel. 22 621 37 82",null,"Płatność"]
[]
[null,"Kategoria","Dział","Symbol","Produkt",null,"Pojemność","Cena netto","Cena brutto","Ilość","Wartość brutto"]
[null,{"$f":"Baza!B3","v":"Kawa"},{"$f":"Baza!C3","v":"Rozpuszczalna"},{"$f":"Baza!D3","v":"gkk0080"},{"$f":"Baza!F3","v":"Nescafe Gold"},null,{"$f":"Baza!G3","v":"200 g"},{"$f":"Baza!H3","v":33.08},{"$f":"Baza!I3","v":40.688399999999994},null,{"$f":"ROUND(I8*J8,2)","v":0}]
[null,null,null,{"$f":"Baza!D4","v":"gkk0050"},{"$f":"Baza!F4","v":"Nescafe Creme Sensazione"},null,{"$f":"Baza!G4","v":"200 g"},{"$f":"Baza!H4","v":19.88},{"$f":"Baza!I4","v":24.452399999999997},null,{"$f":"ROUND(I9*J9,2)","v":0}]
[null,null,null,{"$f":"Baza!D5","v":"gkk0030"},{"$f":"Baza!F5","v":"Nescafe Classic"},null,{"$f":"Baza!G5","v":"200 g"},{"$f":"Baza!H5","v":18.41},{"$f":"Baza!I5","v":22.644300000000001},null,0]
[null,null,null,{"$f":"Baza!D6","v":"gkk0060"},{"$f":"Baza!F6","v":"Nescafe Espresso Int. Puszka"},null,{"$f":"Baza!G6","v":"100 g"},{"$f":"Baza!H6","v":22.45},{"$f":"Baza!I6","v":27.613499999999998},null,0]
[null,null,null,{"$f":"Baza!D7","v":"gkk0210"},{"$f":"Baza!F7","v":"Jacobs Cronat Gold"},null,{"$f":"Baza!G7","v":"200 g"},{"$f":"Baza!H7","v":20.329999999999998},{"$f":"Baza!I7","v":25.005899999999997},null,0]
[null,null,{"$f":"Baza!C8","v":"Mielona"},{"$f":"Baza!D8","v":"gkk0200"},{"$f":"Baza!F8","v":"Tchibo Family Classic"},null,{"$f":"Baza!G8","v":"250 g"},{"$f":"Baza!H8","v":6},{"$f":"Baza!I8","v":7.38},null,0]
[null,null,null,{"$f":"Baza!D9","v":"gkk0140"},{"$f":"Baza!F9","v":"Lavazza Espresso"},null,{"$f":"Baza!G9","v":"250 g"},{"$f":"Baza!H9","v":63},{"$f":"Baza!I9","v":77.489999999999995},null,0]
[null,null,null,{"$f":"Baza!D10","v":"gkk0150"},{"$f":"Baza!F10","v":"Lavazza Qualita Rossa"},null,{"$f":"Baza!G10","v":"250 g"},{"$f":"Baza!H10","v":13.69},{"$f":"Baza!I10","v":16.838699999999999},null,0]
[null,null,null,{"$f":"Baza!D11","v":"gkk0120"},{"$f":"Baza!F11","v":"Lavazza Qualita Oro"},null,{"$f":"Baza!G11","v":"250 g"},{"$f":"Baza!H11","v":15.75},{"$f":"Baza!I11","v":19.372499999999999},null,0]
[null,null,{"$f":"Baza!C12","v":"Ziarnista"},{"$f":"Baza!D12","v":"gkk0130"},{"$f":"Baza!F12","v":"Lavazza Qualita Oro"},null,{"$f":"Baza!G12","v":"250 g"},{"$f":"Baza!H12","v":18.38},{"$f":"Baza!I12","v":22.607399999999998},null,0]
[null,null,null,{"$f":"Baza!D13","v":"gkk0140"},{"$f":"Baza!F13","v":"Lavazza Qualita Oro"},null,{"$f":"Baza!G13","v":"1000 g"},{"$f":"Baza!H13","v":63},{"$f":"Baza!I13","v":77.489999999999995},null,0]
[null,null,null,{"$f":"Baza!D14","v":"gkk0160"},{"$f":"Baza!F14","v":"Lavazza Qualita Rossa"},null,{"$f":"Baza!G14","v":"1000 g"},{"$f":"Baza!H14","v":47.49},{"$f":"Baza!I14","v":58.412700000000001},null,0]
[null,null,null,{"$f":"Baza!D15","v":"gkk0180"},{"$f":"Baza!F15","v":"Lavazza Grand Espresso"},null,{"$f":"Baza!G15","v":"1000 g"},{"$f":"Baza!H15","v":61.69},{"$f":"Baza!I15","v":75.878699999999995},null,0]
[null,null,null,{"$f":"Baza!D16","v":"gkk0190"},{"$f":"Baza!F16","v":"Lavazza Crema e Aroma"},null,{"$f":"Baza!G16","v":"1000 g"},{"$f":"Baza!H16","v":47.49},{"$f":"Baza!I16","v":58.412700000000001},null,0]
[null,{"$f":"Baza!B17","v":"Herbata"},{"$f":"Baza!C17","v":"Czarna"},{"$f":"Baza!D17","v":"ghk0160"},{"$f":"Baza!F17","v":"Lipton Yellow Label"},null,{"$f":"Baza!G17","v":"100 tor."},{"$f":"Baza!H17","v":12.19},{"$f":"Baza!I17","v":14.993699999999999},null,0]
[null,null,null,{"$f":"Baza!D18","v":"ghk0190"},{"$f":"Baza!F18","v":"Lipton Earl Grey"},null,{"$f":"Baza!G18","v":"100 tor."},{"$f":"Baza!H18","v":22.83},{"$f":"Baza!I18","v":28.080899999999996},null,0]
[null,null,null,{"$f":"Baza!D19","v":"ghk0250"},{"$f":"Baza!F19","v":"Lipton Yellow Label"},null,{"$f":"Baza!G19","v":"100 kopert"},{"$f":"Baza!H19","v":35.33},{"$f":"Baza!I19","v":43.4559},null,0]
[null,null,null,{"$f":"Baza!D20","v":"ghk0260"},{"$f":"Baza!F20","v":"Lipton Earl Grey"},null,{"$f":"Baza!G20","v":"100 kopert"},{"$f":"Baza!H20","v":35.049999999999997},{"$f":"Baza!I20","v":43.111499999999992},null,0]
[null,null,null,{"$f":"Baza!D21","v":"ghk0400"},{"$f":"Baza!F21","v":"Saga"},null,{"$f":"Baza!G21","v":"50 tor."},{"$f":"Baza!H21","v":3.28},{"$f":"Baza!I21","v":4.0343999999999998},null,0]
[null,null,null,{"$f":"Baza!D22","v":"ghk0410"},{"$f":"Baza!F22","v":"Saga"},null,{"$f":"Baza!G22","v":"100 tor."},{"$f":"Baza!H22","v":5.94},{"$f":"Baza!I22","v":7.3062000000000005},null,0]
[null,null,null,{"$f":"Baza!D23","v":"ghk0040"},{"$f":"Baza!F23","v":"Dilmah Ceylon Gold"},null,{"$f":"Baza!G23","v":"100 tor."},{"$f":"Baza!H23","v":23.05},{"$f":"Baza!I23","v":28.351500000000001},null,0]
[null,null,null,{"$f":"Baza!D24","v":"ghk0020"},{"$f":"Baza!F24","v":"Dilmah Premium Tea bez zawieszki"},null,{"$f":"Baza!G24","v":"100 tor."},{"$f":"Baza!H24","v":18.079999999999998},{"$f":"Baza!I24","v":22.238399999999999},null,0]
[null,null,null,{"$f":"Baza!D25","v":"ghk0050"},{"$f":"Baza!F25","v":"Dilmah Earl Grey bez zawieszki"},null,{"$f":"Baza!G25","v":"100 tor."},{"$f":"Baza!H25","v":22.76},{"$f":"Baza!I25","v":27.994800000000001},null,0]
[null,null,{"$f":"Baza!C26","v":"Zielona"},{"$f":"Baza!D26","v":"ghk0200"},{"$f":"Baza!F26","v":"Lipton miętowa"},null,{"$f":"Baza!G26","v":"25 tor."},{"$f":"Baza!H26","v":4.74},{"$f":"Baza!I26","v":5.8302000000000005},null,0]
[null,null,null,{"$f":"Baza!D27","v":"ghk0210"},{"$f":"Baza!F27","v":"Lipton cytrusowa"},null,{"$f":"Baza!G27","v":"25 tor."},{"$f":"Baza!H27","v":4.6900000000000004},{"$f":"Baza!I27","v":5.7687000000000008},null,0]
[null,null,null,{"$f":"Baza!D28","v":"ghk0220"},{"$f":"Baza!F28","v":"Lipton classic"},null,{"$f":"Baza!G28","v":"25 tor."},{"$f":"Baza!H28","v":4.6900000000000004},{"$f":"Baza!I28","v":5.7687000000000008},null,0]
[null,null,{"$f":"Baza!C29","v":"Owocowa"},{"$f":"Baza!D29","v":"ghk0340"},{"$f":"Baza!F29","v":"Lipton Piramidka Gold Tea"},null,{"$f":"Baza!G29","v":"20 szt."},{"$f":"Baza!H29","v":7.73},{"$f":"Baza!I29","v":9.5079000000000011},null,0]
[null,null,null,{"$f":"Baza!D30","v":"ghk0350"},{"$f":"Baza!F30","v":"Lipton Piramidka White Raspberry"},null,{"$f":"Baza!G30","v":"20 szt."},{"$f":"Baza!H30","v":6.78},{"$f":"Baza!I30","v":8.3393999999999995},null,0]
[null,null,null,{"$f":"Baza!D31","v":"ghk0360"},{"$f":"Baza!F31","v":"Lipton Piramidka Cytryna"},null,{"$f":"Baza!G31","v":"20 szt."},{"$f":"Baza!H31","v":6.78},{"$f":"Baza!I31","v":8.3393999999999995},null,0]
[null,null,null,{"$f":"Baza!D32","v":"ghk0370"},{"$f":"Baza!F32","v":"Lipton Piramidka Owoce Leśne"},null,{"$f":"Baza!G32","v":"20 szt."},{"$f":"Baza!H32","v":6.78},{"$f":"Baza!I32","v":8.3393999999999995},null,0]
[null,null,null,{"$f":"Baza!D33","v":"ghk0380"},{"$f":"Baza!F33","v":"Lipton Piramidka Indones Sencha"},null,{"$f":"Baza!G33","v":"20 szt."},{"$f":"Baza!H33","v":7.73},{"$f":"Baza!I33","v":9.5079000000000011},null,0]
[null,null,null,{"$f":"Baza!D34","v":"ghk0390"},{"$f":"Baza!F34","v":"Lipton Piramidka Zielona Cytryna Melisa"},null,{"$f":"Baza!G34","v":"20 szt."},{"$f":"Baza!H34","v":6.78},{"$f":"Baza!I34","v":8.3393999999999995},null,0]
[null,null,{"$f":"Baza!C35","v":"Aromatyzowana"},{"$f":"Baza!D35","v":"ghk0280"},{"$f":"Baza!F35","v":"Lipton Green Tea Pure fol."},null,{"$f":"Baza!G35","v":"25 kopert"},{"$f":"Baza!H35","v":10.34},{"$f":"Baza!I35","v":12.7182},null,0]
{"$rows_left_out":98}
{"sheet":"Drukuj","index":3,"n_rows":141,"n_cols":10,"rows_kept":141,"cut":false,"hidden":false,"merged":[[9,3,9,5],[10,3,10,5],[11,3,11,5],[12,3,12,5],[13,3,13,5],[14,3,14,5],[132,1,132,3],[21,3,21,5],[22,3,22,5],[23,3,23,5],[24,3,24,5],[25,3,25,5],[26,3,26,5],[27,3,27,5],[15,3,15,5],[16,3,16,5],[17,3,17,5],[18,3,18,5],[19,3,19,5],[20,3,20,5],[34,3,34,5],[35,3,35,5],[36,3,36,5],[37,3,37,5],[38,3,38,5],[39,3,39,5],[28,3,28,5],[29,3,29,5],[30,3,30,5],[31,3,31,5],[32,3,32,5],[33,3,33,5],[119,3,119,5],[118,3,118,5],[117,3,117,5],[116,3,116,5],[115,3,115,5],[114,3,114,5],[40,3,40,5],[107,3,107,5],[106,3,106,5],[105,3,105,5],[104,3,104,5],[103,3,103,5],[102,3,102,5],[113,3,113,5],[112,3,112,5],[111,3,111,5],[128,3,128,5],[127,3,127,5],[126,3,126,5],[125,3,125,5],[124,3,124,5],[123,3,123,5],[122,3,122,5],[121,3,121,5],[120,3,120,5],[86,3,86,5],[85,3,85,5],[84,3,84,5],[110,3,110,5],[109,3,109,5],[108,3,108,5],[95,3,95,5],[94,3,94,5],[93,3,93,5],[92,3,92,5],[91,3,91,5],[90,3,90,5],[101,3,101,5],[100,3,100,5],[99,3,99,5],[98,3,98,5],[97,3,97,5],[96,3,96,5],[56,3,56,5],[57,3,57,5],[58,3,58,5],[77,3,77,5],[76,3,76,5],[75,3,75,5],[74,3,74,5],[73,3,73,5],[72,3,72,5],[63,3,63,5],[62,3,62,5],[61,3,61,5],[60,3,60,5],[59,3,59,5],[64,3,64,5],[44,3,44,5],[43,3,43,5],[42,3,42,5],[41,3,41,5],[54,3,54,5],[55,3,55,5],[50,3,50,5],[49,3,49,5],[47,3,47,5],[46,3,46,5],[48,3,48,5],[53,3,53,5],[52,3,52,5],[51,3,51,5],[45,3,45,5],[134,1,134,9],[135,1,138,9],[140,1,141,9],[130,6,130,8],[132,6,132,8],[131,6,131,8],[130,1,130,3],[131,1,131,3],[65,3,65,5],[66,3,66,5],[67,3,67,5],[71,3,71,5],[70,3,70,5],[69,3,69,5],[68,3,68,5],[83,3,83,5],[82,3,82,5],[81,3,81,5],[80,3,80,5],[79,3,79,5],[78,3,78,5],[89,3,89,5],[88,3,88,5],[87,3,87,5],[6,7,7,9],[1,1,1,4],[7,1,7,4],[6,1,6,4],[3,1,3,4],[2,1,2,4],[4,1,4,4],[5,1,5,4],[1,6,1,9],[2,7,2,9],[3,7,3,9],[4,7,4,9],[5,7,5,9]]}
[]
[null,null,null,null,null,null,"Dane Zamawiającego"]
[null,"GAMAT s. c.",null,null,null,null,"NIP",{"$f":"GAMAT!F3","v":1234567890}]
[null,"W. Janiszewski, M. Janiszewska",null,null,null,null,"Miejscowość",{"$f":"GAMAT!F4","v":"Warszawa"}]
[null,"ul. Koszykowa 35",null,null,null,null,"Kod pocztowy",{"$f":"GAMAT!H3","v":12345}]
[null,"00-553 Warszawa",null,null,null,null,"Płatność",{"$f":"INDEX(GAMAT!$P$2:$P$4,GAMAT!$Q$2,1)","v":"Przelew"}]
[null,"Numer rachunku bankowego:",null,null,null,null,"Adres dostawy",{"$f":"GAMAT!H4","v":"  "}]
[null,"mBank 26-1140-2004-0000-3602-3390-8699"]
[]
[null,"Lp.","Symbol","Produkt",null,null,"Cena netto","Cena brutto","Ilość","Wartość brutto"]
[null,1,{"$f":"Baza!D3","v":"gkk0080"},{"$f":"Baza!E3","v":"Nescafe Gold 200 g"},null,null,{"$f":"Baza!H3","v":33.08},{"$f":"Baza!I3","v":40.688399999999994},{"$f":"GAMAT!J8","v":0},{"$f":"GAMAT!K8","v":0}]
[null,2,{"$f":"Baza!D4","v":"gkk0050"},{"$f":"Baza!E4","v":"Nescafe Creme Sensazione 200 g"},null,null,{"$f":"Baza!H4","v":19.88},{"$f":"Baza!I4","v":24.452399999999997},{"$f":"GAMAT!J9","v":0},{"$f":"GAMAT!K9","v":0}]
[null,3,{"$f":"Baza!D5","v":"gkk0030"},{"$f":"Baza!E5","v":"Nescafe Classic 200 g"},null,null,{"$f":"Baza!H5","v":18.41},{"$f":"Baza!I5","v":22.644300000000001},{"$f":"GAMAT!J10","v":0},{"$f":"GAMAT!K10","v":0}]
[null,4,{"$f":"Baza!D6","v":"gkk0060"},{"$f":"Baza!E6","v":"Nescafe Espresso Int. Puszka 100 g"},null,null,{"$f":"Baza!H6","v":22.45},{"$f":"Baza!I6","v":27.613499999999998},{"$f":"GAMAT!J11","v":0},{"$f":"GAMAT!K11","v":0}]
[null,5,{"$f":"Baza!D7","v":"gkk0210"},{"$f":"Baza!E7","v":"Jacobs Cronat Gold 200 g"},null,null,{"$f":"Baza!H7","v":20.329999999999998},{"$f":"Baza!I7","v":25.005899999999997},{"$f":"GAMAT!J12","v":0},{"$f":"GAMAT!K12","v":0}]
[null,6,{"$f":"Baza!D8","v":"gkk0200"},{"$f":"Baza!E8","v":"Tchibo Family Classic 250 g"},null,null,{"$f":"Baza!H8","v":6},{"$f":"Baza!I8","v":7.38},{"$f":"GAMAT!J13","v":0},{"$f":"GAMAT!K13","v":0}]
[null,7,{"$f":"Baza!D9","v":"gkk0140"},{"$f":"Baza!E9","v":"Lavazza Espresso 250 g"},null,null,{"$f":"Baza!H9","v":63},{"$f":"Baza!I9","v":77.489999999999995},{"$f":"GAMAT!J14","v":0},{"$f":"GAMAT!K14","v":0}]
[null,8,{"$f":"Baza!D10","v":"gkk0150"},{"$f":"Baza!E10","v":"Lavazza Qualita Rossa 250 g"},null,null,{"$f":"Baza!H10","v":13.69},{"$f":"Baza!I10","v":16.838699999999999},{"$f":"GAMAT!J15","v":0},{"$f":"GAMAT!K15","v":0}]
[null,9,{"$f":"Baza!D11","v":"gkk0120"},{"$f":"Baza!E11","v":"Lavazza Qualita Oro 250 g"},null,null,{"$f":"Baza!H11","v":15.75},{"$f":"Baza!I11","v":19.372499999999999},{"$f":"GAMAT!J16","v":0},{"$f":"GAMAT!K16","v":0}]
[null,10,{"$f":"Baza!D12","v":"gkk0130"},{"$f":"Baza!E12","v":"Lavazza Qualita Oro 250 g"},null,null,{"$f":"Baza!H12","v":18.38},{"$f":"Baza!I12","v":22.607399999999998},{"$f":"GAMAT!J17","v":0},{"$f":"GAMAT!K17","v":0}]
[null,11,{"$f":"Baza!D13","v":"gkk0140"},{"$f":"Baza!E13","v":"Lavazza Qualita Oro 1000 g"},null,null,{"$f":"Baza!H13","v":63},{"$f":"Baza!I13","v":77.489999999999995},{"$f":"GAMAT!J18","v":0},{"$f":"GAMAT!K18","v":0}]
[null,12,{"$f":"Baza!D14","v":"gkk0160"},{"$f":"Baza!E14","v":"Lavazza Qualita Rossa 1000 g"},null,null,{"$f":"Baza!H14","v":47.49},{"$f":"Baza!I14","v":58.412700000000001},{"$f":"GAMAT!J19","v":0},{"$f":"GAMAT!K19","v":0}]
[null,13,{"$f":"Baza!D15","v":"gkk0180"},{"$f":"Baza!E15","v":"Lavazza Grand Espresso 1000 g"},null,null,{"$f":"Baza!H15","v":61.69},{"$f":"Baza!I15","v":75.878699999999995},{"$f":"GAMAT!J20","v":0},{"$f":"GAMAT!K20","v":0}]
[null,14,{"$f":"Baza!D16","v":"gkk0190"},{"$f":"Baza!E16","v":"Lavazza Crema e Aroma 1000 g"},null,null,{"$f":"Baza!H16","v":47.49},{"$f":"Baza!I16","v":58.412700000000001},{"$f":"GAMAT!J21","v":0},{"$f":"GAMAT!K21","v":0}]
[null,15,{"$f":"Baza!D17","v":"ghk0160"},{"$f":"Baza!E17","v":"Lipton Yellow Label 100 tor."},null,null,{"$f":"Baza!H17","v":12.19},{"$f":"Baza!I17","v":14.993699999999999},{"$f":"GAMAT!J22","v":0},{"$f":"GAMAT!K22","v":0}]
[null,16,{"$f":"Baza!D18","v":"ghk0190"},{"$f":"Baza!E18","v":"Lipton Earl Grey 100 tor."},null,null,{"$f":"Baza!H18","v":22.83},{"$f":"Baza!I18","v":28.080899999999996},{"$f":"GAMAT!J23","v":0},{"$f":"GAMAT!K23","v":0}]
[null,17,{"$f":"Baza!D19","v":"ghk0250"},{"$f":"Baza!E19","v":"Lipton Yellow Label 100 kopert"},null,null,{"$f":"Baza!H19","v":35.33},{"$f":"Baza!I19","v":43.4559},{"$f":"GAMAT!J24","v":0},{"$f":"GAMAT!K24","v":0}]
[null,18,{"$f":"Baza!D20","v":"ghk0260"},{"$f":"Baza!E20","v":"Lipton Earl Grey 100 kopert"},null,null,{"$f":"Baza!H20","v":35.049999999999997},{"$f":"Baza!I20","v":43.111499999999992},{"$f":"GAMAT!J25","v":0},{"$f":"GAMAT!K25","v":0}]
[null,19,{"$f":"Baza!D21","v":"ghk0400"},{"$f":"Baza!E21","v":"Saga 50 tor."},null,null,{"$f":"Baza!H21","v":3.28},{"$f":"Baza!I21","v":4.0343999999999998},{"$f":"GAMAT!J26","v":0},{"$f":"GAMAT!K26","v":0}]
[null,20,{"$f":"Baza!D22","v":"ghk0410"},{"$f":"Baza!E22","v":"Saga 100 tor."},null,null,{"$f":"Baza!H22","v":5.94},{"$f":"Baza!I22","v":7.3062000000000005},{"$f":"GAMAT!J27","v":0},{"$f":"GAMAT!K27","v":0}]
[null,21,{"$f":"Baza!D23","v":"ghk0040"},{"$f":"Baza!E23","v":"Dilmah Ceylon Gold 100 tor."},null,null,{"$f":"Baza!H23","v":23.05},{"$f":"Baza!I23","v":28.351500000000001},{"$f":"GAMAT!J28","v":0},{"$f":"GAMAT!K28","v":0}]
[null,22,{"$f":"Baza!D24","v":"ghk0020"},{"$f":"Baza!E24","v":"Dilmah Premium Tea 100 tor. bez zawieszki"},null,null,{"$f":"Baza!H24","v":18.079999999999998},{"$f":"Baza!I24","v":22.238399999999999},{"$f":"GAMAT!J29","v":0},{"$f":"GAMAT!K29","v":0}]
[null,23,{"$f":"Baza!D25","v":"ghk0050"},{"$f":"Baza!E25","v":"Dilmah Earl Grey 100 tor. bez zawieszki"},null,null,{"$f":"Baza!H25","v":22.76},{"$f":"Baza!I25","v":27.994800000000001},{"$f":"GAMAT!J30","v":0},{"$f":"GAMAT!K30","v":0}]
[null,24,{"$f":"Baza!D26","v":"ghk0200"},{"$f":"Baza!E26","v":"Lipton miętowa 25 tor."},null,null,{"$f":"Baza!H26","v":4.74},{"$f":"Baza!I26","v":5.8302000000000005},{"$f":"GAMAT!J31","v":0},{"$f":"GAMAT!K31","v":0}]
[null,25,{"$f":"Baza!D27","v":"ghk0210"},{"$f":"Baza!E27","v":"Lipton cytrusowa 25 tor."},null,null,{"$f":"Baza!H27","v":4.6900000000000004},{"$f":"Baza!I27","v":5.7687000000000008},{"$f":"GAMAT!J32","v":0},{"$f":"GAMAT!K32","v":0}]
[null,26,{"$f":"Baza!D28","v":"ghk0220"},{"$f":"Baza!E28","v":"Lipton classic 25 tor."},null,null,{"$f":"Baza!H28","v":4.6900000000000004},{"$f":"Baza!I28","v":5.7687000000000008},{"$f":"GAMAT!J33","v":0},{"$f":"GAMAT!K33","v":0}]
[null,27,{"$f":"Baza!D29","v":"ghk0340"},{"$f":"Baza!E29","v":"Lipton Piramidka Gold Tea 20 szt"},null,null,{"$f":"Baza!H29","v":7.73},{"$f":"Baza!I29","v":9.5079000000000011},{"$f":"GAMAT!J34","v":0},{"$f":"GAMAT!K34","v":0}]
[null,28,{"$f":"Baza!D30","v":"ghk0350"},{"$f":"Baza!E30","v":"Lipton Piramidka White Raspberry 20 szt"},null,null,{"$f":"Baza!H30","v":6.78},{"$f":"Baza!I30","v":8.3393999999999995},{"$f":"GAMAT!J35","v":0},{"$f":"GAMAT!K35","v":0}]
[null,29,{"$f":"Baza!D31","v":"ghk0360"},{"$f":"Baza!E31","v":"Lipton Piramidka Cytryna 20 szt"},null,null,{"$f":"Baza!H31","v":6.78},{"$f":"Baza!I31","v":8.3393999999999995},{"$f":"GAMAT!J36","v":0},{"$f":"GAMAT!K36","v":0}]
[null,30,{"$f":"Baza!D32","v":"ghk0370"},{"$f":"Baza!E32","v":"Lipton Piramidka Owoce Leśne 20 szt"},null,null,{"$f":"Baza!H32","v":6.78},{"$f":"Baza!I32","v":8.3393999999999995},{"$f":"GAMAT!J37","v":0},{"$f":"GAMAT!K37","v":0}]
{"$rows_left_out":101}