{"text_format":"1","workbook":"xlsx","n_sheets":4,"sheets":["Main","Baza","GAMAT","Drukuj"],"not_rendered":{"charts":0,"images":5,"macros":1,"external_links":0,"defined_names":3,"comments":0,"pivot_tables":0},"unopened":[],"bounds":{"document_bytes":16777216,"sheet_cells":100000,"rows_first":2000,"rows_last":500,"rows_between":2000,"halvings":0,"cell_chars":16384,"cell_head_chars":4096},"cells_cut":0,"cells_raw":0,"read":"whole","date_system":"1900"}

{"sheet":"Main","index":0,"n_rows":19,"n_cols":14,"rows_kept":19,"cut":false,"hidden":true,"merged":[[1,1,3,1],[6,2,6,4],[6,5,6,8],[10,2,10,4],[5,2,5,8],[9,1,11,1],[5,1,7,1],[2,2,2,4],[2,5,2,8],[3,5,3,8],[1,2,1,8],[3,2,3,4],[11,2,11,4],[10,5,10,8],[11,5,11,8],[7,5,7,8],[7,2,7,4],[9,2,9,8],[13,1,15,1],[13,2,13,8],[14,2,14,4],[14,5,14,8],[15,2,15,4],[15,5,15,8]]}
[]
[null,null,"Dostawa"]
[null,null,"Opłata",null,null,11]
[null,null,"Darmowa dostawa",null,null,300]
[]
[null,null,"Upominek"]
[null,null,"Nazwa upominku",null,null,"Kolekcja czekoladek Merci Finest 250g"]
[null,null,"Od jakiej wartości",null,null,500]
[]
[null,null,"Czas dostawy (dni robocze)"]
[null,null,"Warszawa",null,null,1]
[null,null,"Poza Warszawą",null,null,2]
[]
[null,null,"Płatność",null,null,null,null,null,null,null,null,null,"Warszawa","Poza Warszawą"]
[null,null,"Warszawa",null,null,null,null,null,null,null,null,"Przelew",true,false]
[null,null,"Poza Warszawą",null,null,null,null,null,null,null,null,"Gotówka",true,false]
[null,null,null,null,null,null,null,null,null,null,null,"Przedpłata",false,true]
[null,"Problemy/Pytania"]
[null,"Drukowanie -> Lp. pozostaje bez zmian. Można to zmienić"]

{"sheet":"Baza","index":1,"n_rows":121,"n_cols":9,"rows_kept":121,"cut":false,"hidden":true,"merged":[]}
[]
[null,"Kategoria","Dział","Symbol","Produkt","Produkt (nazwa bez jednostek)","Pojemność","Cena netto","Cena brutto"]
[null,"Kawa","Rozpuszczalna","gkk0080","Nescafe Gold 200 g","Nescafe Gold","200 g",33.08,40.688399999999994]
[null,"Kawa","Rozpuszczalna","gkk0050","Nescafe Creme Sensazione 200 g","Nescafe Creme Sensazione","200 g",19.88,24.452399999999997]
[null,"Kawa","Rozpuszczalna","gkk0030","Nescafe Classic 200 g","Nescafe Classic","200 g",18.41,22.644300000000001]
[null,"Kawa","Rozpuszczalna","gkk0060","Nescafe Espresso Int. Puszka 100 g","Nescafe Espresso Int. Puszka","100 g",22.45,27.613499999999998]
[null,"Kawa","Rozpuszczalna","gkk0210","Jacobs Cronat Gold 200 g","Jacobs Cronat Gold","200 g",20.329999999999998,25.005899999999997]
[null,"Kawa","Mielona","gkk0200","Tchibo Family Classic 250 g","Tchibo Family Classic","250 g",6,7.38]
[null,"Kawa","Mielona","gkk0140","Lavazza Espresso 250 g","Lavazza Espresso","250 g",63,77.489999999999995]
[null,"Kawa","Mielona","gkk0150","Lavazza Qualita Rossa 250 g","Lavazza Qualita Rossa","250 g",13.69,16.838699999999999]
[null,"Kawa","Mielona","gkk0120","Lavazza Qualita Oro 250 g","Lavazza Qualita Oro","250 g",15.75,19.372499999999999]
[null,"Kawa","Ziarnista","gkk0130","Lavazza Qualita Oro 250 g","Lavazza Qualita Oro","250 g",18.38,22.607399999999998]
[null,"Kawa","Ziarnista","gkk0140","Lavazza Qualita Oro 1000 g","Lavazza Qualita Oro","1000 g",63,77.489999999999995]
[null,"Kawa","Ziarnista","gkk0160","Lavazza Qualita Rossa 1000 g","Lavazza Qualita Rossa","1000 g",47.49,58.412700000000001]
[null,"Kawa","Ziarnista","gkk0180","Lavazza Grand Espresso 1000 g","Lavazza Grand Espresso","1000 g",61.69,75.878699999999995]
[null,"Kawa","Ziarnista","gkk0190","Lavazza Crema e Aroma 1000 g","Lavazza Crema e Aroma","1000 g",47.49,58.412700000000001]
[null,"Herbata","Czarna","ghk0160","Lipton Yellow Label 100 tor.","Lipton Yellow Label","100 tor.",12.19,14.993699999999999]
[null,"Herbata","Czarna","ghk0190","Lipton Earl Grey 100 tor.","Lipton Earl Grey","100 tor.",22.83,28.080899999999996]
[null,"Herbata","Czarna","ghk0250","Lipton Yellow Label 100 kopert","Lipton Yellow Label","100 kopert",35.33,43.4559]
[null,"Herbata","Czarna","ghk0260","Lipton Earl Grey 100 kopert","Lipton Earl Grey","100 kopert",35.049999999999997,43.111499999999992]
[null,"Herbata","Czarna","ghk0400","Saga 50 tor.","Saga","50 tor.",3.28,4.0343999999999998]
[null,"Herbata","Czarna","ghk0410","Saga 100 tor.","Saga","100 tor.",5.94,7.3062000000000005]
[null,"Herbata","Czarna","ghk0040","Dilmah Ceylon Gold 100 tor.","Dilmah Ceylon Gold","100 tor.",23.05,28.351500000000001]
[null,"Herbata","Czarna","ghk0020","Dilmah Premium Tea 100 tor. bez zawieszki","Dilmah Premium Tea bez zawieszki","100 tor.",18.079999999999998,22.238399999999999]
[null,"Herbata","Czarna","ghk0050","Dilmah Earl Grey 100 tor. bez zawieszki","Dilmah Earl Grey bez zawieszki","100 tor.",22.76,27.994800000000001]
[null,"Herbata","Zielona","ghk0200","Lipton miętowa 25 tor.","Lipton miętowa","25 tor.",4.74,5.8302000000000005]
[null,"Herbata","Zielona","ghk0210","Lipton cytrusowa 25 tor.","Lipton cytrusowa","25 tor.",4.6900000000000004,5.7687000000000008]
[null,"Herbata","Zielona","ghk0220","Lipton classic 25 tor.","Lipton classic","25 tor.",4.6900000000000004,5.7687000000000008]
[null,"Herbata","Owocowa","ghk0340","Lipton Piramidka Gold Tea 20 szt","Lipton Piramidka Gold Tea","20 szt.",7.73,9.5079000000000011]
[null,"Herbata","Owocowa","ghk0350","Lipton Piramidka White Raspberry 20 szt","Lipton Piramidka White Raspberry","20 szt.",6.78,8.3393999999999995]
[null,"Herbata","Owocowa","ghk0360","Lipton Piramidka Cytryna 20 szt","Lipton Piramidka Cytryna","20 szt.",6.78,8.3393999999999995]
[null,"Herbata","Owocowa","ghk0370","Lipton Piramidka Owoce Leśne 20 szt","Lipton Piramidka Owoce Leśne","20 szt.",6.78,8.3393999999999995]
[null,"Herbata","Owocowa","ghk0380","Lipton Piramidka Indones Sencha 20 szt","Lipton Piramidka Indones Sencha","20 szt.",7.73,9.5079000000000011]
[null,"Herbata","Owocowa","ghk0390","Lipton Piramidka Zielona Cytryna Melisa 20 szt","Lipton Piramidka Zielona Cytryna Melisa","20 szt.",6.78,8.3393999999999995]
[null,"Herbata","Aromatyzowana","ghk0280","Lipton Green Tea Pure 25 kopert fol.","Lipton Green Tea Pure fol.","25 kopert",10.34,12.7182]
[null,"Herbata","Aromatyzowana","ghk0290","Lipton Green Tea Mint 25 kopert fol.","Lipton Green Tea Mint fol.","25 kopert",10.55,12.976500000000001]
[null,"Herbata","Aromatyzowana","ghk0300","Lipton Green Tea Citrus 25 kopert fol.","Lipton Green Tea Citrus fol.","25 kopert",10.45,12.853499999999999]
[null,"Herbata","Aromatyzowana","ghk0310","Lipton Green Tea Orient 25 kopert fol.","Lipton Green Tea Orient fol.","25 kopert",10.34,12.7182]
[null,"Herbata","Aromatyzowana","ghk0320","Lipton Owocowa Fruit Influsion 25 kopert fol.","Lipton Owocowa Fruit Influsion fol.","25 kopert",11.95,14.698499999999999]
[null,"Herbata","Aromatyzowana","ghk0330","Lipton Vanilia 25 kopert fol.","Lipton Vanilia fol.","25 kopert",10.34,12.7182]
[null,"Herbata","Aromatyzowana","ghk0230","Lipton More Than One Tea 12 smaków - 180 kopert","Lipton More Than One Tea 12 smaków","180 kopert",81.58,100.3434]
[null,"Herbata","Aromatyzowana","ghk0060","Dilmah Jagody z Wanilią 20 tor.","Dilmah Jagody z Wanilią","20 tor.",6.48,7.9704000000000006]
[null,"Herbata","Aromatyzowana","ghk0070","Dilmah Earl Grey 20 tor.","Dilmah Earl Grey","20 tor.",6.48,7.9704000000000006]
[null,"Herbata","Aromatyzowana","ghk0080","Dilmah Cytryny 20 tor.","Dilmah Cytryny","20 tor.",6.48,7.9704000000000006]
[null,"Herbata","Aromatyzowana","ghk0090","Dilmah Maliny 20 tor.","Dilmah Maliny","20 tor.",6.48,7.9704000000000006]
[null,"Herbata","Aromatyzowana","ghk0100","Dilmah Wanilia 20 tor.","Dilmah Wanilia","20 tor.",6.48,7.9704000000000006]
[null,"Herbata","Aromatyzowana","ghk0110","Dilmah Mango z Truskawką 20 tor.","Dilmah Mango z Truskawką","20 tor.",6.48,7.9704000000000006]
[null,"Herbata","Aromatyzowana","ghk0140","Dilmah Pick mix 12 czarnych gatunków - 240 kopert","Dilmah Pick mix 12 czarnych gatunków","240 kopert",120.13,147.75989999999999]
[null,"Dodatki","Cukier","gck0010","Diamant sypki biały 1 kg","Diamant sypki biały","1 kg",4.33,4.6764000000000001]
[null,"Dodatki","Cukier","gck0160","Diamant w kostkach biały 0,5 kg","Diamant w kostkach biały","0,5 kg",3.76,4.0608000000000004]
[null,"Dodatki","Mleko","gnk0550","Łaciate 0,5% 0,5 litra","Łaciate 0,5%","0,5 l",1.46,1.5329999999999999]
[null,"Dodatki","Mleko","gnk0540","Łaciate 0,5% 1 litr","Łaciate 0,5%","1 l",2.5299999999999998,2.6564999999999999]
[null,"Dodatki","Mleko","gnk0440","Łaciate 2% 0,5 litra","Łaciate 2%","0,5 l",1.58,1.6590000000000003]
[null,"Dodatki","Mleko","gnk0430","Łaciate 2% 1 litr","Łaciate 2%","1 l",2.7,2.8350000000000004]
[null,"Dodatki","Mleko","gnk0420","Łaciate 3,2% 0,5 litra","Łaciate 3,2%","0,5 l",1.61,1.6905000000000001]
[null,"Dodatki","Mleko","gnk0410","Łaciate 3,2% 1 litr","Łaciate 3,2%","1 l",2.86,3.0030000000000001]
[null,"Dodatki","Mleko","gnk0560","Łaciate zagęszczone niesłodzone 7,5% 0,25 litra","Łaciate zagęszczone niesłodzone 7,5%","0,25 l",1.68,1.764]
[null,"Dodatki","Mleko","gnk0570","Łaciate zagęszczone niesłodzone 7,5% 0,5 litra","Łaciate zagęszczone niesłodzone 7,5%","0,5 l",2.79,2.9295]
[null,"Dodatki","Mleko","gnk0460","Gostyń zagęszczone niesłodzone Light 4 % 0,5 litra","Gostyń zagęszczone niesłodzone Light 4 %","0,5 l",4.04,4.242]
[null,"Dodatki","Mleko","gnk0450","Gostyń zagęszczone niesłodzone 7,5% 0,5 litra","Gostyń zagęszczone niesłodzone 7,5%","0,5 l",4.01,4.2104999999999997]
[null,"Dodatki","Inne","gnk0510","Łaciate śmietanka 10 ml x 10 szt","Łaciate śmietanka","10 ml x 10 szt.",1.1299999999999999,1.1864999999999999]
[null,"Dodatki","Inne","gnk0490","Champion cytrynka 100% sok 7,5 g x 10 szt","Champion cytrynka 100% sok","7,5 g x 10 szt.",1.6,1.6800000000000002]
[null,"Woda","Niegazowana","gnk0600","Cisowianka 0,5 litra","Cisowianka","0,5 l",0.83,1.0208999999999999]
[null,"Woda","Niegazowana","gnk0610","Cisowianka 1,5 litra","Cisowianka","1,5 l",1.18,1.4513999999999998]
[null,"Woda","Niegazowana","gnk0850","Cisowianka 0,3 litra but. Szklana","Cisowianka but. Szklana","0,3 l",1.35,1.6605000000000001]
[null,"Woda","Niegazowana","gnk0870","Cisowianka 0,7 litra but. Szklana","Cisowianka but. Szklana","0,7 l",2.2400000000000002,2.7552000000000003]
[null,"Woda","Niegazowana","gnk0250","Nałęczowianka 0,5 litra","Nałęczowianka","0,5 l",1.05,1.2915000000000001]
[null,"Woda","Niegazowana","gnk0240","Nałęczowianka 1,5 litra","Nałęczowianka","1,5 l",1.31,1.6113]
[null,"Woda","Niegazowana","gnk0640","Żywiec Zdrój 0,5 litra","Żywiec Zdrój","0,5 l",1.26,1.5498000000000001]
[null,"Woda","Niegazowana","gnk0650","Żywiec Zdrój 1,5 litra","Żywiec Zdrój","1,5 l",1.64,2.0171999999999999]
[null,"Woda","Niegazowana","gnk0160","Kropla Beskidu 0,25 litra but. Szklana","Kropla Beskidu but. Szklana","0,25 l",1.23,1.5128999999999999]
[null,"Woda","Niegazowana","gnk0180","Kropla Beskidu 0,5 litra","Kropla Beskidu","0,5 l",1.55,1.9065000000000001]
[null,"Woda","Niegazowana","gnk0200","Kropla Beskidu 1,75 litra","Kropla Beskidu","1,75 l",1.9,2.3369999999999997]
[null,"Woda","Lekkogazowana","gnk0840","Cisowianka 0,5 litra","Cisowianka","0,5 l",0.83,1.0208999999999999]
[null,"Woda","Lekkogazowana","gnk0611","Cisowianka 1,5 litra","Cisowianka","1,5 l",1.18,1.4513999999999998]
[null,"Woda","Lekkogazowana","gnk0900","Cisowianka musująca Parlage 0,7 litra","Cisowianka musująca Parlage","0,7 l",1.21,1.4883]
[null,"Woda","Lekkogazowana","gnk0860","Cisowianka musująca Parlage 0,3 litra but. Szklana","Cisowianka musująca Parlage but. Szklana","0,3 l",1.54,1.8942000000000001]
[null,"Woda","Lekkogazowana","gnk0880","Cisowianka musująca Parlage 0,7 litra but. Szklana","Cisowianka musująca Parlage but. Szklana","0,7 l",2.36,2.9027999999999996]
[null,"Woda","Lekkogazowana","gnk0660","Muszynianka niskonasycona 0,6 litra","Muszynianka niskonasycona","0,6 l",1.29,1.5867]
[null,"Woda","Lekkogazowana","gnk0670","Muszynianka niskonasycona 1,5 litra","Muszynianka niskonasycona","1,5 l",1.69,2.0787]
[null,"Woda","Lekkogazowana","gnk0680","Muszynianka średnionasycona (niebieska) 1,5 litra","Muszynianka średnionasycona (niebieska)","1,5 l",1.66,2.0417999999999998]
[null,"Woda","Gazowana","gnk0580","Cisowianka 0,5 litra","Cisowianka","0,5 l",0.83,1.0208999999999999]
[null,"Woda","Gazowana","gnk0590","Cisowianka 1,5 litra","Cisowianka","1,5 l",1.18,1.4513999999999998]
[null,"Woda","Gazowana","gnk0861","Cisowianka silnie gazowana 0,3 litra but. Szklana","Cisowianka silnie gazowana but. Szklana","0,3 l",1.3,1.599]
[null,"Woda","Gazowana","gnk0862","Cisowianka silnie gazowana 0,7 litra but. Szklana","Cisowianka silnie gazowana but. Szklana","0,7 l",1.93,2.3738999999999999]
[null,"Woda","Gazowana","gnk0230","Nalęczowianka 0,5 litra","Nalęczowianka","0,5 l",1.05,1.2915000000000001]
[null,"Woda","Gazowana","gnk0220","Nalęczowianka 1,5 litra","Nalęczowianka","1,5 l",1.31,1.6113]
[null,"Woda","Gazowana","gnk0620","Żywiec Zdrój 0,5 litra","Żywiec Zdrój","0,5 l",1.26,1.5498000000000001]
[null,"Woda","Gazowana","gnk0630","Żywiec Zdrój 1,5 litra","Żywiec Zdrój","1,5 l",1.64,2.0171999999999999]
[null,"Woda","Gazowana","gnk0170","Kropla Beskidu 0,25 litra but. Szklana","Kropla Beskidu but. Szklana","0,25 l",1.23,1.5128999999999999]
[null,"Woda","Gazowana","gnk0190","Kropla Beskidu 0,5 litra","Kropla Beskidu","0,5 l",1.55,1.9065000000000001]
[null,"Woda","Gazowana","gnk0210","Kropla Beskidu 1,75 litra","Kropla Beskidu","1,75 l",1.9,2.3369999999999997]
[null,"Napoje","Nestea","gnk0280","Cytrynowa","Cytrynowa","0,5 l",2.86,3.5177999999999998]
[null,"Napoje","Nestea","gnk0290","Brzoskwiniowa","Brzoskwiniowa","0,5 l",2.86,3.5177999999999998]
[null,"Napoje","Nestea","gnk0300","Zielono-cytrynowa","Zielono-cytrynowa","0,5 l",2.79,3.4317000000000002]
[null,"Napoje","Cappy","gnk0310","Sok 100% pomarańczowy 0,33 litra","Sok 100% pomarańczowy","0,33 l",2.41,2.5305000000000004]
[null,"Napoje","Cappy","gnk0320","Sok 100% jabłkowy 0,33 litra","Sok 100% jabłkowy","0,33 l",2.41,2.5305000000000004]
[null,"Napoje","Cappy","gnk0340","Sok multiwitamina 0,33 litra","Sok multiwitamina","0,33 l",2.41,2.5305000000000004]
[null,"Napoje","Cappy","gnk0350","Sok 100% pomarańczowy 1 litr","Sok 100% pomarańczowy","1 l",5.39,5.6594999999999995]
[null,"Napoje","Cappy","gnk0360","Sok cała pomarańcza 1 litr","Sok cała pomarańcza","1 l",6.14,6.4470000000000001]
[null,"Napoje","Cappy","gnk0370","Sok 100% jabłkowy 1 litr","Sok 100% jabłkowy","1 l",4.1500000000000004,4.3575000000000008]
[null,"Napoje","Cappy","gnk0380","Sok czarna porzeczka 1 litr","Sok czarna porzeczka","1 l",5.24,5.5020000000000007]
[null,"Napoje","Cappy","gnk0390","Sok grejpfrutowy 1 litr","Sok grejpfrutowy","1 l",5.03,5.2815000000000003]
[null,"Napoje","Tymbark","gnk0690","Sok pomarańczowy 0,3 litra","Sok pomarańczowy","0,3 l",1.78,1.8690000000000002]
[null,"Napoje","Tymbark","gnk0700","Sok jabłkowy 0,3 litra","Sok jabłkowy","0,3 l",1.78,1.8690000000000002]
[null,"Napoje","Tymbark","gnk0710","Nekrat czarna porzeczka 0,3 litra","Nekrat czarna porzeczka","0,3 l",1.78,1.8690000000000002]
[null,"Napoje","Tymbark","gnk0720","Sok świeży pomidor 0,3 litra","Sok świeży pomidor","0,3 l",1.78,1.8690000000000002]
[null,"Napoje","Tymbark","gnk0730","Nektar czerwony grejpfrut 0,3 litra","Nektar czerwony grejpfrut","0,3 l",1.78,1.8690000000000002]
[null,"Napoje","Tymbark","gnk0760","Sok pomarańczowy 1 Litr ","Sok pomarańczowy","1 l",4.6500000000000004,4.8825000000000003]
[null,"Napoje","Tymbark","gnk0770","Sok jabłkowy 1 Litr","Sok jabłkowy","1 l",3.58,3.7590000000000003]
[null,"Napoje","Tymbark","gnk0780","Nektar czarna porzeczka 1 Litr","Nektar czarna porzeczka","1 l",4.6500000000000004,4.8825000000000003]
[null,"Napoje","Tymbark","gnk0790","Sok 100% czerwony grejpfrut 1 Litr ","Sok 100% czerwony grejpfrut","1 l",4.45,4.6725000000000003]
[null,"Napoje","Tymbark","gnk0800","Sok pomidorowy 1 Litr","Sok pomidorowy","1 l",3.58,3.7590000000000003]
[null,"Napoje","Tymbark","gnk0810","Sok multiwitamina classic 1 Litra","Sok multiwitamina classic","1 l",4.01,4.2104999999999997]
[null,"Napoje","Tymbark","gnk0830","Nektar z czerwony pomarańczy sycylijskich 1 litr","Nektar z czerwony pomarańczy sycylijskich","1 l",4.4400000000000004,4.6620000000000008]
[null,"Napoje gaz.","Coca-Cola","gnk0040","Zwykła 0,5 Litra","Zwykła","0,5 l",3.04,3.7391999999999999]
[null,"Napoje gaz.","Coca-Cola","gnk0070","Zwykła 1,0 Litr","Zwykła","1 l",3.98,4.8953999999999995]
[null,"Napoje gaz.","Coca-Cola","gnk0060","Zero 0,5 Litra","Zero","0,5 l",3.04,3.7391999999999999]
[null,"Napoje gaz.","Coca-Cola","gnk0090","Zero 1,0 Litr","Zero","1 l",3.98,4.8953999999999995]
[null,"Napoje gaz.","Coca-Cola","gnk0050","Light 0,5 Litra","Light","0,5 l",3.04,3.7391999999999999]
[null,"Napoje gaz.","Coca-Cola","gnk0080","Light 1,0 Litr","Light","1 l",3.63,4.4649000000000001]

{"sheet":"GAMAT","index":2,"n_rows":137,"n_cols":17,"rows_kept":137,"cut":false,"hidden":false,"merged":[[7,2,11,2],[12,2,15,2],[16,2,20,2],[21,2,29,2],[30,2,32,2],[33,2,38,2],[7,4,7,5],[8,4,8,5],[7,1,20,1],[21,1,52,1],[39,2,52,2],[13,4,13,5],[14,4,14,5],[15,4,15,5],[16,4,16,5],[17,4,17,5],[18,4,18,5],[19,4,19,5],[20,4,20,5],[21,4,21,5],[32,4,32,5],[33,4,33,5],[40,4,40,5],[41,4,41,5],[53,2,54,2],[55,2,64,2],[65,2,66,2],[67,2,77,2],[78,2,85,2],[86,2,96,2],[53,1,66,1],[67,1,96,1],[97,1,119,1],[129,7,129,10],[130,7,130,9],[131,7,131,10],[127,1,127,6],[128,1,131,6],[97,2,99,2],[100,2,107,2],[108,2,119,2],[120,2,125,2],[127,7,127,9],[128,7,128,9],[123,4,123,5],[124,4,124,5],[125,4,125,5],[115,4,115,5],[120,1,125,1],[120,4,120,5],[121,4,121,5],[122,4,122,5],[119,4,119,5],[118,4,118,5],[117,4,117,5],[116,4,116,5],[105,4,105,5],[6,4,6,5],[9,4,9,5],[10,4,10,5],[11,4,11,5],[12,4,12,5],[28,4,28,5],[29,4,29,5],[30,4,30,5],[31,4,31,5],[22,4,22,5],[23,4,23,5],[24,4,24,5],[25,4,25,5],[26,4,26,5],[27,4,27,5],[42,4,42,5],[43,4,43,5],[44,4,44,5],[45,4,45,5],[34,4,34,5],[35,4,35,5],[36,4,36,5],[37,4,37,5],[38,4,38,5],[39,4,39,5],[52,4,52,5],[53,4,53,5],[54,4,54,5],[55,4,55,5],[56,4,56,5],[57,4,57,5],[46,4,46,5],[47,4,47,5],[48,4,48,5],[49,4,49,5],[50,4,50,5],[51,4,51,5],[58,4,58,5],[59,4,59,5],[60,4,60,5],[61,4,61,5],[62,4,62,5],[63,4,63,5],[114,4,114,5],[113,4,113,5],[112,4,112,5],[111,4,111,5],[110,4,110,5],[109,4,109,5],[64,4,64,5],[65,4,65,5],[66,4,66,5],[102,4,102,5],[101,4,101,5],[100,4,100,5],[99,4,99,5],[98,4,98,5],[97,4,97,5],[108,4,108,5],[107,4,107,5],[106,4,106,5],[104,4,104,5],[103,4,103,5],[69,4,69,5],[70,4,70,5],[71,4,71,5],[96,4,96,5],[95,4,95,5],[94,4,94,5],[93,4,93,5],[92,4,92,5],[91,4,91,5],[2,7,2,8],[84,4,84,5],[85,4,85,5],[136,1,137,10],[3,7,4,8],[78,4,78,5],[79,4,79,5],[80,4,80,5],[81,4,81,5],[82,4,82,5],[83,4,83,5],[72,4,72,5],[73,4,73,5],[74,4,74,5],[75,4,75,5],[76,4,76,5],[77,4,77,5],[90,4,90,5],[89,4,89,5],[88,4,88,5],[87,4,87,5],[86,4,86,5],[67,4,67,5],[68,4,68,5]]}
[]
[null,null,"GAMAT",null,"Dane Zamawiającego",null,null,null,null,null,null,null,null,null,null,{"$f":"IF(F4=\"Warszawa\",IF(Main!M15=TRUE,Main!L15,\"\"),IF(Main!N15=TRUE,Main!L15,\"\"))","v":"Przelew"},1]
[null,null,"www.gamat.pl",null,"NIP",1234567890,"Kod pocztowy",12345,null,null,null,null,null,null,null,{"$f":"IF(F4=\"Warszawa\",IF(Main!M16=TRUE,Main!L16,\"\"),IF(Main!N16=TRUE,Main!L16,\"\"))","v":"Gotówka"}]
[null,null,"gamatsc@gamat.pl",null,"Miejscowość","Warszawa","Adres dostawy","  ",null,null,null,null,null,null,null,{"$f":"IF(F4=\"Warszawa\",IF(Main!M17=TRUE,Main!L17,\"\"),IF(Main!N17=TRUE,Main!L17,\"\"))","v":""}]
[null,null,"tel. 22 621 37 82",null,"Płatność"]
[]
[null,"Kategoria","Dział","Symbol","Produkt",null,"Pojemność","Cena netto","Cena brutto","Ilość","Wartość brutto"]
[null,{"$f":"Baza!B3","v":"Kawa"},{"$f":"Baza!C3","v":"Rozpuszczalna"},{"$f":"Baza!D3","v":"gkk0080"},{"$f":"Baza!F3","v":"Nescafe Gold"},null,{"$f":"Baza!G3","v":"200 g"},{"$f":"Baza!H3","v":33.08},{"$f":"Baza!I3","v":40.688399999999994},null,{"$f":"ROUND(I8*J8,2)","v":0}]
[null,null,null,{"$f":"Baza!D4","v":"gkk0050"},{"$f":"Baza!F4","v":"Nescafe Creme Sensazione"},null,{"$f":"Baza!G4","v":"200 g"},{"$f":"Baza!H4","v":19.88},{"$f":"Baza!I4","v":24.452399999999997},null,{"$f":"ROUND(I9*J9,2)","v":0}]
[null,null,null,{"$f":"Baza!D5","v":"gkk0030"},{"$f":"Baza!F5","v":"Nescafe Classic"},null,{"$f":"Baza!G5","v":"200 g"},{"$f":"Baza!H5","v":18.41},{"$f":"Baza!I5","v":22.644300000000001},null,0]
[null,null,null,{"$f":"Baza!D6","v":"gkk0060"},{"$f":"Baza!F6","v":"Nescafe Espresso Int. Puszka"},null,{"$f":"Baza!G6","v":"100 g"},{"$f":"Baza!H6","v":22.45},{"$f":"Baza!I6","v":27.613499999999998},null,0]
[null,null,null,{"$f":"Baza!D7","v":"gkk0210"},{"$f":"Baza!F7","v":"Jacobs Cronat Gold"},null,{"$f":"Baza!G7","v":"200 g"},{"$f":"Baza!H7","v":20.329999999999998},{"$f":"Baza!I7","v":25.005899999999997},null,0]
[null,null,{"$f":"Baza!C8","v":"Mielona"},{"$f":"Baza!D8","v":"gkk0200"},{"$f":"Baza!F8","v":"Tchibo Family Classic"},null,{"$f":"Baza!G8","v":"250 g"},{"$f":"Baza!H8","v":6},{"$f":"Baza!I8","v":7.38},null,0]
[null,null,null,{"$f":"Baza!D9","v":"gkk0140"},{"$f":"Baza!F9","v":"Lavazza Espresso"},null,{"$f":"Baza!G9","v":"250 g"},{"$f":"Baza!H9","v":63},{"$f":"Baza!I9","v":77.489999999999995},null,0]
[null,null,null,{"$f":"Baza!D10","v":"gkk0150"},{"$f":"Baza!F10","v":"Lavazza Qualita Rossa"},null,{"$f":"Baza!G10","v":"250 g"},{"$f":"Baza!H10","v":13.69},{"$f":"Baza!I10","v":16.838699999999999},null,0]
[null,null,null,{"$f":"Baza!D11","v":"gkk0120"},{"$f":"Baza!F11","v":"Lavazza Qualita Oro"},null,{"$f":"Baza!G11","v":"250 g"},{"$f":"Baza!H11","v":15.75},{"$f":"Baza!I11","v":19.372499999999999},null,0]
[null,null,{"$f":"Baza!C12","v":"Ziarnista"},{"$f":"Baza!D12","v":"gkk0130"},{"$f":"Baza!F12","v":"Lavazza Qualita Oro"},null,{"$f":"Baza!G12","v":"250 g"},{"$f":"Baza!H12","v":18.38},{"$f":"Baza!I12","v":22.607399999999998},null,0]
[null,null,null,{"$f":"Baza!D13","v":"gkk0140"},{"$f":"Baza!F13","v":"Lavazza Qualita Oro"},null,{"$f":"Baza!G13","v":"1000 g"},{"$f":"Baza!H13","v":63},{"$f":"Baza!I13","v":77.489999999999995},null,0]
[null,null,null,{"$f":"Baza!D14","v":"gkk0160"},{"$f":"Baza!F14","v":"Lavazza Qualita Rossa"},null,{"$f":"Baza!G14","v":"1000 g"},{"$f":"Baza!H14","v":47.49},{"$f":"Baza!I14","v":58.412700000000001},null,0]
[null,null,null,{"$f":"Baza!D15","v":"gkk0180"},{"$f":"Baza!F15","v":"Lavazza Grand Espresso"},null,{"$f":"Baza!G15","v":"1000 g"},{"$f":"Baza!H15","v":61.69},{"$f":"Baza!I15","v":75.878699999999995},null,0]
[null,null,null,{"$f":"Baza!D16","v":"gkk0190"},{"$f":"Baza!F16","v":"Lavazza Crema e Aroma"},null,{"$f":"Baza!G16","v":"1000 g"},{"$f":"Baza!H16","v":47.49},{"$f":"Baza!I16","v":58.412700000000001},null,0]
[null,{"$f":"Baza!B17","v":"Herbata"},{"$f":"Baza!C17","v":"Czarna"},{"$f":"Baza!D17","v":"ghk0160"},{"$f":"Baza!F17","v":"Lipton Yellow Label"},null,{"$f":"Baza!G17","v":"100 tor."},{"$f":"Baza!H17","v":12.19},{"$f":"Baza!I17","v":14.993699999999999},null,0]
[null,null,null,{"$f":"Baza!D18","v":"ghk0190"},{"$f":"Baza!F18","v":"Lipton Earl Grey"},null,{"$f":"Baza!G18","v":"100 tor."},{"$f":"Baza!H18","v":22.83},{"$f":"Baza!I18","v":28.080899999999996},null,0]
[null,null,null,{"$f":"Baza!D19","v":"ghk0250"},{"$f":"Baza!F19","v":"Lipton Yellow Label"},null,{"$f":"Baza!G19","v":"100 kopert"},{"$f":"Baza!H19","v":35.33},{"$f":"Baza!I19","v":43.4559},null,0]
[null,null,null,{"$f":"Baza!D20","v":"ghk0260"},{"$f":"Baza!F20","v":"Lipton Earl Grey"},null,{"$f":"Baza!G20","v":"100 kopert"},{"$f":"Baza!H20","v":35.049999999999997},{"$f":"Baza!I20","v":43.111499999999992},null,0]
[null,null,null,{"$f":"Baza!D21","v":"ghk0400"},{"$f":"Baza!F21","v":"Saga"},null,{"$f":"Baza!G21","v":"50 tor."},{"$f":"Baza!H21","v":3.28},{"$f":"Baza!I21","v":4.0343999999999998},null,0]
[null,null,null,{"$f":"Baza!D22","v":"ghk0410"},{"$f":"Baza!F22","v":"Saga"},null,{"$f":"Baza!G22","v":"100 tor."},{"$f":"Baza!H22","v":5.94},{"$f":"Baza!I22","v":7.3062000000000005},null,0]
[null,null,null,{"$f":"Baza!D23","v":"ghk0040"},{"$f":"Baza!F23","v":"Dilmah Ceylon Gold"},null,{"$f":"Baza!G23","v":"100 tor."},{"$f":"Baza!H23","v":23.05},{"$f":"Baza!I23","v":28.351500000000001},null,0]
[null,null,null,{"$f":"Baza!D24","v":"ghk0020"},{"$f":"Baza!F24","v":"Dilmah Premium Tea bez zawieszki"},null,{"$f":"Baza!G24","v":"100 tor."},{"$f":"Baza!H24","v":18.079999999999998},{"$f":"Baza!I24","v":22.238399999999999},null,0]
[null,null,null,{"$f":"Baza!D25","v":"ghk0050"},{"$f":"Baza!F25","v":"Dilmah Earl Grey bez zawieszki"},null,{"$f":"Baza!G25","v":"100 tor."},{"$f":"Baza!H25","v":22.76},{"$f":"Baza!I25","v":27.994800000000001},null,0]
[null,null,{"$f":"Baza!C26","v":"Zielona"},{"$f":"Baza!D26","v":"ghk0200"},{"$f":"Baza!F26","v":"Lipton miętowa"},null,{"$f":"Baza!G26","v":"25 tor."},{"$f":"Baza!H26","v":4.74},{"$f":"Baza!I26","v":5.8302000000000005},null,0]
[null,null,null,{"$f":"Baza!D27","v":"ghk0210"},{"$f":"Baza!F27","v":"Lipton cytrusowa"},null,{"$f":"Baza!G27","v":"25 tor."},{"$f":"Baza!H27","v":4.6900000000000004},{"$f":"Baza!I27","v":5.7687000000000008},null,0]
[null,null,null,{"$f":"Baza!D28","v":"ghk0220"},{"$f":"Baza!F28","v":"Lipton classic"},null,{"$f":"Baza!G28","v":"25 tor."},{"$f":"Baza!H28","v":4.6900000000000004},{"$f":"Baza!I28","v":5.7687000000000008},null,0]
[null,null,{"$f":"Baza!C29","v":"Owocowa"},{"$f":"Baza!D29","v":"ghk0340"},{"$f":"Baza!F29","v":"Lipton Piramidka Gold Tea"},null,{"$f":"Baza!G29","v":"20 szt."},{"$f":"Baza!H29","v":7.73},{"$f":"Baza!I29","v":9.5079000000000011},null,0]
[null,null,null,{"$f":"Baza!D30","v":"ghk0350"},{"$f":"Baza!F30","v":"Lipton Piramidka White Raspberry"},null,{"$f":"Baza!G30","v":"20 szt."},{"$f":"Baza!H30","v":6.78},{"$f":"Baza!I30","v":8.3393999999999995},null,0]
[null,null,null,{"$f":"Baza!D31","v":"ghk0360"},{"$f":"Baza!F31","v":"Lipton Piramidka Cytryna"},null,{"$f":"Baza!G31","v":"20 szt."},{"$f":"Baza!H31","v":6.78},{"$f":"Baza!I31","v":8.3393999999999995},null,0]
[null,null,null,{"$f":"Baza!D32","v":"ghk0370"},{"$f":"Baza!F32","v":"Lipton Piramidka Owoce Leśne"},null,{"$f":"Baza!G32","v":"20 szt."},{"$f":"Baza!H32","v":6.78},{"$f":"Baza!I32","v":8.3393999999999995},null,0]
[null,null,null,{"$f":"Baza!D33","v":"ghk0380"},{"$f":"Baza!F33","v":"Lipton Piramidka Indones Sencha"},null,{"$f":"Baza!G33","v":"20 szt."},{"$f":"Baza!H33","v":7.73},{"$f":"Baza!I33","v":9.5079000000000011},null,0]
[null,null,null,{"$f":"Baza!D34","v":"ghk0390"},{"$f":"Baza!F34","v":"Lipton Piramidka Zielona Cytryna Melisa"},null,{"$f":"Baza!G34","v":"20 szt."},{"$f":"Baza!H34","v":6.78},{"$f":"Baza!I34","v":8.3393999999999995},null,0]
[null,null,{"$f":"Baza!C35","v":"Aromatyzowana"},{"$f":"Baza!D35","v":"ghk0280"},{"$f":"Baza!F35","v":"Lipton Green Tea Pure fol."},null,{"$f":"Baza!G35","v":"25 kopert"},{"$f":"Baza!H35","v":10.34},{"$f":"Baza!I35","v":12.7182},null,0]
[null,null,null,{"$f":"Baza!D36","v":"ghk0290"},{"$f":"Baza!F36","v":"Lipton Green Tea Mint fol."},null,{"$f":"Baza!G36","v":"25 kopert"},{"$f":"Baza!H36","v":10.55},{"$f":"Baza!I36","v":12.976500000000001},null,0]
[null,null,null,{"$f":"Baza!D37","v":"ghk0300"},{"$f":"Baza!F37","v":"Lipton Green Tea Citrus fol."},null,{"$f":"Baza!G37","v":"25 kopert"},{"$f":"Baza!H37","v":10.45},{"$f":"Baza!I37","v":12.853499999999999},null,0]
[null,null,null,{"$f":"Baza!D38","v":"ghk0310"},{"$f":"Baza!F38","v":"Lipton Green Tea Orient fol."},null,{"$f":"Baza!G38","v":"25 kopert"},{"$f":"Baza!H38","v":10.34},{"$f":"Baza!I38","v":12.7182},null,0]
[null,null,null,{"$f":"Baza!D39","v":"ghk0320"},{"$f":"Baza!F39","v":"Lipton Owocowa Fruit Influsion fol."},null,{"$f":"Baza!G39","v":"25 kopert"},{"$f":"Baza!H39","v":11.95},{"$f":"Baza!I39","v":14.698499999999999},null,0]
[null,null,null,{"$f":"Baza!D40","v":"ghk0330"},{"$f":"Baza!F40","v":"Lipton Vanilia fol."},null,{"$f":"Baza!G40","v":"25 kopert"},{"$f":"Baza!H40","v":10.34},{"$f":"Baza!I40","v":12.7182},null,0]
[null,null,null,{"$f":"Baza!D41","v":"ghk0230"},{"$f":"Baza!F41","v":"Lipton More Than One Tea 12 smaków"},null,{"$f":"Baza!G41","v":"180 kopert"},{"$f":"Baza!H41","v":81.58},{"$f":"Baza!I41","v":100.3434},null,0]
[null,null,null,{"$f":"Baza!D42","v":"ghk0060"},{"$f":"Baza!F42","v":"Dilmah Jagody z Wanilią"},null,{"$f":"Baza!G42","v":"20 tor."},{"$f":"Baza!H42","v":6.48},{"$f":"Baza!I42","v":7.9704000000000006},null,0]
[null,null,null,{"$f":"Baza!D43","v":"ghk0070"},{"$f":"Baza!F43","v":"Dilmah Earl Grey"},null,{"$f":"Baza!G43","v":"20 tor."},{"$f":"Baza!H43","v":6.48},{"$f":"Baza!I43","v":7.9704000000000006},null,0]
[null,null,null,{"$f":"Baza!D44","v":"ghk0080"},{"$f":"Baza!F44","v":"Dilmah Cytryny"},null,{"$f":"Baza!G44","v":"20 tor."},{"$f":"Baza!H44","v":6.48},{"$f":"Baza!I44","v":7.9704000000000006},null,0]
[null,null,null,{"$f":"Baza!D45","v":"ghk0090"},{"$f":"Baza!F45","v":"Dilmah Maliny"},null,{"$f":"Baza!G45","v":"20 tor."},{"$f":"Baza!H45","v":6.48},{"$f":"Baza!I45","v":7.9704000000000006},null,0]
[null,null,null,{"$f":"Baza!D46","v":"ghk0100"},{"$f":"Baza!F46","v":"Dilmah Wanilia"},null,{"$f":"Baza!G46","v":"20 tor."},{"$f":"Baza!H46","v":6.48},{"$f":"Baza!I46","v":7.9704000000000006},null,0]
[null,null,null,{"$f":"Baza!D47","v":"ghk0110"},{"$f":"Baza!F47","v":"Dilmah Mango z Truskawką"},null,{"$f":"Baza!G47","v":"20 tor."},{"$f":"Baza!H47","v":6.48},{"$f":"Baza!I47","v":7.9704000000000006},null,0]
[null,null,null,{"$f":"Baza!D48","v":"ghk0140"},{"$f":"Baza!F48","v":"Dilmah Pick mix 12 czarnych gatunków"},null,{"$f":"Baza!G48","v":"240 kopert"},{"$f":"Baza!H48","v":120.13},{"$f":"Baza!I48","v":147.75989999999999},null,0]
[null,{"$f":"Baza!B49","v":"Dodatki"},{"$f":"Baza!C49","v":"Cukier"},{"$f":"Baza!D49","v":"gck0010"},{"$f":"Baza!F49","v":"Diamant sypki biały"},null,{"$f":"Baza!G49","v":"1 kg"},{"$f":"Baza!H49","v":4.33},{"$f":"Baza!I49","v":4.6764000000000001},null,0]
[null,null,null,{"$f":"Baza!D50","v":"gck0160"},{"$f":"Baza!F50","v":"Diamant w kostkach biały"},null,{"$f":"Baza!G50","v":"0,5 kg"},{"$f":"Baza!H50","v":3.76},{"$f":"Baza!I50","v":4.0608000000000004},null,0]
[null,null,{"$f":"Baza!C51","v":"Mleko"},{"$f":"Baza!D51","v":"gnk0550"},{"$f":"Baza!F51","v":"Łaciate 0,5%"},null,{"$f":"Baza!G51","v":"0,5 l"},{"$f":"Baza!H51","v":1.46},{"$f":"Baza!I51","v":1.5329999999999999},null,0]
[null,null,null,{"$f":"Baza!D52","v":"gnk0540"},{"$f":"Baza!F52","v":"Łaciate 0,5%"},null,{"$f":"Baza!G52","v":"1 l"},{"$f":"Baza!H52","v":2.5299999999999998},{"$f":"Baza!I52","v":2.6564999999999999},null,0]
[null,null,null,{"$f":"Baza!D53","v":"gnk0440"},{"$f":"Baza!F53","v":"Łaciate 2%"},null,{"$f":"Baza!G53","v":"0,5 l"},{"$f":"Baza!H53","v":1.58},{"$f":"Baza!I53","v":1.6590000000000003},null,0]
[null,null,null,{"$f":"Baza!D54","v":"gnk0430"},{"$f":"Baza!F54","v":"Łaciate 2%"},null,{"$f":"Baza!G54","v":"1 l"},{"$f":"Baza!H54","v":2.7},{"$f":"Baza!I54","v":2.8350000000000004},null,0]
[null,null,null,{"$f":"Baza!D55","v":"gnk0420"},{"$f":"Baza!F55","v":"Łaciate 3,2%"},null,{"$f":"Baza!G55","v":"0,5 l"},{"$f":"Baza!H55","v":1.61},{"$f":"Baza!I55","v":1.6905000000000001},null,0]
[null,null,null,{"$f":"Baza!D56","v":"gnk0410"},{"$f":"Baza!F56","v":"Łaciate 3,2%"},null,{"$f":"Baza!G56","v":"1 l"},{"$f":"Baza!H56","v":2.86},{"$f":"Baza!I56","v":3.0030000000000001},null,0]
[null,null,null,{"$f":"Baza!D57","v":"gnk0560"},{"$f":"Baza!F57","v":"Łaciate zagęszczone niesłodzone 7,5%"},null,{"$f":"Baza!G57","v":"0,25 l"},{"$f":"Baza!H57","v":1.68},{"$f":"Baza!I57","v":1.764},null,0]
[null,null,null,{"$f":"Baza!D58","v":"gnk0570"},{"$f":"Baza!F58","v":"Łaciate zagęszczone niesłodzone 7,5%"},null,{"$f":"Baza!G58","v":"0,5 l"},{"$f":"Baza!H58","v":2.79},{"$f":"Baza!I58","v":2.9295},null,0]
[null,null,null,{"$f":"Baza!D59","v":"gnk0460"},{"$f":"Baza!F59","v":"Gostyń zagęszczone niesłodzone Light 4 %"},null,{"$f":"Baza!G59","v":"0,5 l"},{"$f":"Baza!H59","v":4.04},{"$f":"Baza!I59","v":4.242},null,0]
[null,null,null,{"$f":"Baza!D60","v":"gnk0450"},{"$f":"Baza!F60","v":"Gostyń zagęszczone niesłodzone 7,5%"},null,{"$f":"Baza!G60","v":"0,5 l"},{"$f":"Baza!H60","v":4.01},{"$f":"Baza!I60","v":4.2104999999999997},null,0]
[null,null,{"$f":"Baza!C61","v":"Inne"},{"$f":"Baza!D61","v":"gnk0510"},{"$f":"Baza!F61","v":"Łaciate śmietanka"},null,{"$f":"Baza!G61","v":"10 ml x 10 szt."},{"$f":"Baza!H61","v":1.1299999999999999},{"$f":"Baza!I61","v":1.1864999999999999},null,0]
[null,null,null,{"$f":"Baza!D62","v":"gnk0490"},{"$f":"Baza!F62","v":"Champion cytrynka 100% sok"},null,{"$f":"Baza!G62","v":"7,5 g x 10 szt."},{"$f":"Baza!H62","v":1.6},{"$f":"Baza!I62","v":1.6800000000000002},null,0]
[null,{"$f":"Baza!B63","v":"Woda"},{"$f":"Baza!C63","v":"Niegazowana"},{"$f":"Baza!D63","v":"gnk0600"},{"$f":"Baza!F63","v":"Cisowianka"},null,{"$f":"Baza!G63","v":"0,5 l"},{"$f":"Baza!H63","v":0.83},{"$f":"Baza!I63","v":1.0208999999999999},null,0]
[null,null,null,{"$f":"Baza!D64","v":"gnk0610"},{"$f":"Baza!F64","v":"Cisowianka"},null,{"$f":"Baza!G64","v":"1,5 l"},{"$f":"Baza!H64","v":1.18},{"$f":"Baza!I64","v":1.4513999999999998},null,0]
[null,null,null,{"$f":"Baza!D65","v":"gnk0850"},{"$f":"Baza!F65","v":"Cisowianka but. Szklana"},null,{"$f":"Baza!G65","v":"0,3 l"},{"$f":"Baza!H65","v":1.35},{"$f":"Baza!I65","v":1.6605000000000001},null,0]
[null,null,null,{"$f":"Baza!D66","v":"gnk0870"},{"$f":"Baza!F66","v":"Cisowianka but. Szklana"},null,{"$f":"Baza!G66","v":"0,7 l"},{"$f":"Baza!H66","v":2.2400000000000002},{"$f":"Baza!I66","v":2.7552000000000003},null,0]
[null,null,null,{"$f":"Baza!D67","v":"gnk0250"},{"$f":"Baza!F67","v":"Nałęczowianka"},null,{"$f":"Baza!G67","v":"0,5 l"},{"$f":"Baza!H67","v":1.05},{"$f":"Baza!I67","v":1.2915000000000001},null,0]
[null,null,null,{"$f":"Baza!D68","v":"gnk0240"},{"$f":"Baza!F68","v":"Nałęczowianka"},null,{"$f":"Baza!G68","v":"1,5 l"},{"$f":"Baza!H68","v":1.31},{"$f":"Baza!I68","v":1.6113},null,{"$f":"ROUND(I73*J73,2)","v":0}]
[null,null,null,{"$f":"Baza!D69","v":"gnk0640"},{"$f":"Baza!F69","v":"Żywiec Zdrój"},null,{"$f":"Baza!G69","v":"0,5 l"},{"$f":"Baza!H69","v":1.26},{"$f":"Baza!I69","v":1.5498000000000001},null,0]
[null,null,null,{"$f":"Baza!D70","v":"gnk0650"},{"$f":"Baza!F70","v":"Żywiec Zdrój"},null,{"$f":"Baza!G70","v":"1,5 l"},{"$f":"Baza!H70","v":1.64},{"$f":"Baza!I70","v":2.0171999999999999},null,0]
[null,null,null,{"$f":"Baza!D71","v":"gnk0160"},{"$f":"Baza!F71","v":"Kropla Beskidu but. Szklana"},null,{"$f":"Baza!G71","v":"0,25 l"},{"$f":"Baza!H71","v":1.23},{"$f":"Baza!I71","v":1.5128999999999999},null,0]
[null,null,null,{"$f":"Baza!D72","v":"gnk0180"},{"$f":"Baza!F72","v":"Kropla Beskidu"},null,{"$f":"Baza!G72","v":"0,5 l"},{"$f":"Baza!H72","v":1.55},{"$f":"Baza!I72","v":1.9065000000000001},null,0]
[null,null,null,{"$f":"Baza!D73","v":"gnk0200"},{"$f":"Baza!F73","v":"Kropla Beskidu"},null,{"$f":"Baza!G73","v":"1,75 l"},{"$f":"Baza!H73","v":1.9},{"$f":"Baza!I73","v":2.3369999999999997},null,0]
[null,null,{"$f":"Baza!C74","v":"Lekkogazowana"},{"$f":"Baza!D74","v":"gnk0840"},{"$f":"Baza!F74","v":"Cisowianka"},null,{"$f":"Baza!G74","v":"0,5 l"},{"$f":"Baza!H74","v":0.83},{"$f":"Baza!I74","v":1.0208999999999999},null,0]
[null,null,null,{"$f":"Baza!D75","v":"gnk0611"},{"$f":"Baza!F75","v":"Cisowianka"},null,{"$f":"Baza!G75","v":"1,5 l"},{"$f":"Baza!H75","v":1.18},{"$f":"Baza!I75","v":1.4513999999999998},null,0]
[null,null,null,{"$f":"Baza!D76","v":"gnk0900"},{"$f":"Baza!F76","v":"Cisowianka musująca Parlage"},null,{"$f":"Baza!G76","v":"0,7 l"},{"$f":"Baza!H76","v":1.21},{"$f":"Baza!I76","v":1.4883},null,0]
[null,null,null,{"$f":"Baza!D77","v":"gnk0860"},{"$f":"Baza!F77","v":"Cisowianka musująca Parlage but. Szklana"},null,{"$f":"Baza!G77","v":"0,3 l"},{"$f":"Baza!H77","v":1.54},{"$f":"Baza!I77","v":1.8942000000000001},null,0]
[null,null,null,{"$f":"Baza!D78","v":"gnk0880"},{"$f":"Baza!F78","v":"Cisowianka musująca Parlage but. Szklana"},null,{"$f":"Baza!G78","v":"0,7 l"},{"$f":"Baza!H78","v":2.36},{"$f":"Baza!I78","v":2.9027999999999996},null,0]
[null,null,null,{"$f":"Baza!D79","v":"gnk0660"},{"$f":"Baza!F79","v":"Muszynianka niskonasycona"},null,{"$f":"Baza!G79","v":"0,6 l"},{"$f":"Baza!H79","v":1.29},{"$f":"Baza!I79","v":1.5867},null,0]
[null,null,null,{"$f":"Baza!D80","v":"gnk0670"},{"$f":"Baza!F80","v":"Muszynianka niskonasycona"},null,{"$f":"Baza!G80","v":"1,5 l"},{"$f":"Baza!H80","v":1.69},{"$f":"Baza!I80","v":2.0787},null,0]
[null,null,null,{"$f":"Baza!D81","v":"gnk0680"},{"$f":"Baza!F81","v":"Muszynianka średnionasycona (niebieska)"},null,{"$f":"Baza!G81","v":"1,5 l"},{"$f":"Baza!H81","v":1.66},{"$f":"Baza!I81","v":2.0417999999999998},null,0]
[null,null,{"$f":"Baza!C82","v":"Gazowana"},{"$f":"Baza!D82","v":"gnk0580"},{"$f":"Baza!F82","v":"Cisowianka"},null,{"$f":"Baza!G82","v":"0,5 l"},{"$f":"Baza!H82","v":0.83},{"$f":"Baza!I82","v":1.0208999999999999},null,0]
[null,null,null,{"$f":"Baza!D83","v":"gnk0590"},{"$f":"Baza!F83","v":"Cisowianka"},null,{"$f":"Baza!G83","v":"1,5 l"},{"$f":"Baza!H83","v":1.18},{"$f":"Baza!I83","v":1.4513999999999998},null,0]
[null,null,null,{"$f":"Baza!D84","v":"gnk0861"},{"$f":"Baza!F84","v":"Cisowianka silnie gazowana but. Szklana"},null,{"$f":"Baza!G84","v":"0,3 l"},{"$f":"Baza!H84","v":1.3},{"$f":"Baza!I84","v":1.599},null,0]
[null,null,null,{"$f":"Baza!D85","v":"gnk0862"},{"$f":"Baza!F85","v":"Cisowianka silnie gazowana but. Szklana"},null,{"$f":"Baza!G85","v":"0,7 l"},{"$f":"Baza!H85","v":1.93},{"$f":"Baza!I85","v":2.3738999999999999},null,0]
[null,null,null,{"$f":"Baza!D86","v":"gnk0230"},{"$f":"Baza!F86","v":"Nalęczowianka"},null,{"$f":"Baza!G86","v":"0,5 l"},{"$f":"Baza!H86","v":1.05},{"$f":"Baza!I86","v":1.2915000000000001},null,0]
[null,null,null,{"$f":"Baza!D87","v":"gnk0220"},{"$f":"Baza!F87","v":"Nalęczowianka"},null,{"$f":"Baza!G87","v":"1,5 l"},{"$f":"Baza!H87","v":1.31},{"$f":"Baza!I87","v":1.6113},null,0]
[null,null,null,{"$f":"Baza!D88","v":"gnk0620"},{"$f":"Baza!F88","v":"Żywiec Zdrój"},null,{"$f":"Baza!G88","v":"0,5 l"},{"$f":"Baza!H88","v":1.26},{"$f":"Baza!I88","v":1.5498000000000001},null,0]
[null,null,null,{"$f":"Baza!D89","v":"gnk0630"},{"$f":"Baza!F89","v":"Żywiec Zdrój"},null,{"$f":"Baza!G89","v":"1,5 l"},{"$f":"Baza!H89","v":1.64},{"$f":"Baza!I89","v":2.0171999999999999},null,0]
[null,null,null,{"$f":"Baza!D90","v":"gnk0170"},{"$f":"Baza!F90","v":"Kropla Beskidu but. Szklana"},null,{"$f":"Baza!G90","v":"0,25 l"},{"$f":"Baza!H90","v":1.23},{"$f":"Baza!I90","v":1.5128999999999999},null,0]
[null,null,null,{"$f":"Baza!D91","v":"gnk0190"},{"$f":"Baza!F91","v":"Kropla Beskidu"},null,{"$f":"Baza!G91","v":"0,5 l"},{"$f":"Baza!H91","v":1.55},{"$f":"Baza!I91","v":1.9065000000000001},null,0]
[null,null,null,{"$f":"Baza!D92","v":"gnk0210"},{"$f":"Baza!F92","v":"Kropla Beskidu"},null,{"$f":"Baza!G92","v":"1,75 l"},{"$f":"Baza!H92","v":1.9},{"$f":"Baza!I92","v":2.3369999999999997},null,0]
[null,{"$f":"Baza!B93","v":"Napoje"},{"$f":"Baza!C93","v":"Nestea"},{"$f":"Baza!D93","v":"gnk0280"},{"$f":"Baza!F93","v":"Cytrynowa"},null,{"$f":"Baza!G93","v":"0,5 l"},{"$f":"Baza!H93","v":2.86},{"$f":"Baza!I93","v":3.5177999999999998},null,0]
[null,null,null,{"$f":"Baza!D94","v":"gnk0290"},{"$f":"Baza!F94","v":"Brzoskwiniowa"},null,{"$f":"Baza!G94","v":"0,5 l"},{"$f":"Baza!H94","v":2.86},{"$f":"Baza!I94","v":3.5177999999999998},null,0]
[null,null,null,{"$f":"Baza!D95","v":"gnk0300"},{"$f":"Baza!F95","v":"Zielono-cytrynowa"},null,{"$f":"Baza!G95","v":"0,5 l"},{"$f":"Baza!H95","v":2.79},{"$f":"Baza!I95","v":3.4317000000000002},null,0]
[null,null,{"$f":"Baza!C96","v":"Cappy"},{"$f":"Baza!D96","v":"gnk0310"},{"$f":"Baza!F96","v":"Sok 100% pomarańczowy"},null,{"$f":"Baza!G96","v":"0,33 l"},{"$f":"Baza!H96","v":2.41},{"$f":"Baza!I96","v":2.5305000000000004},null,0]
[null,null,null,{"$f":"Baza!D97","v":"gnk0320"},{"$f":"Baza!F97","v":"Sok 100% jabłkowy"},null,{"$f":"Baza!G97","v":"0,33 l"},{"$f":"Baza!H97","v":2.41},{"$f":"Baza!I97","v":2.5305000000000004},null,0]
[null,null,null,{"$f":"Baza!D98","v":"gnk0340"},{"$f":"Baza!F98","v":"Sok multiwitamina"},null,{"$f":"Baza!G98","v":"0,33 l"},{"$f":"Baza!H98","v":2.41},{"$f":"Baza!I98","v":2.5305000000000004},null,0]
[null,null,null,{"$f":"Baza!D99","v":"gnk0350"},{"$f":"Baza!F99","v":"Sok 100% pomarańczowy"},null,{"$f":"Baza!G99","v":"1 l"},{"$f":"Baza!H99","v":5.39},{"$f":"Baza!I99","v":5.6594999999999995},null,0]
[null,null,null,{"$f":"Baza!D100","v":"gnk0360"},{"$f":"Baza!F100","v":"Sok cała pomarańcza"},null,{"$f":"Baza!G100","v":"1 l"},{"$f":"Baza!H100","v":6.14},{"$f":"Baza!I100","v":6.4470000000000001},null,0]
[null,null,null,{"$f":"Baza!D101","v":"gnk0370"},{"$f":"Baza!F101","v":"Sok 100% jabłkowy"},null,{"$f":"Baza!G101","v":"1 l"},{"$f":"Baza!H101","v":4.1500000000000004},{"$f":"Baza!I101","v":4.3575000000000008},null,0]
[null,null,null,{"$f":"Baza!D102","v":"gnk0380"},{"$f":"Baza!F102","v":"Sok czarna porzeczka"},null,{"$f":"Baza!G102","v":"1 l"},{"$f":"Baza!H102","v":5.24},{"$f":"Baza!I102","v":5.5020000000000007},null,0]
[null,null,null,{"$f":"Baza!D103","v":"gnk0390"},{"$f":"Baza!F103","v":"Sok grejpfrutowy"},null,{"$f":"Baza!G103","v":"1 l"},{"$f":"Baza!H103","v":5.03},{"$f":"Baza!I103","v":5.2815000000000003},null,0]
[null,null,{"$f":"Baza!C104","v":"Tymbark"},{"$f":"Baza!D104","v":"gnk0690"},{"$f":"Baza!F104","v":"Sok pomarańczowy"},null,{"$f":"Baza!G104","v":"0,3 l"},{"$f":"Baza!H104","v":1.78},{"$f":"Baza!I104","v":1.8690000000000002},null,0]
[null,null,null,{"$f":"Baza!D105","v":"gnk0700"},{"$f":"Baza!F105","v":"Sok jabłkowy"},null,{"$f":"Baza!G105","v":"0,3 l"},{"$f":"Baza!H105","v":1.78},{"$f":"Baza!I105","v":1.8690000000000002},null,0]
[null,null,null,{"$f":"Baza!D106","v":"gnk0710"},{"$f":"Baza!F106","v":"Nekrat czarna porzeczka"},null,{"$f":"Baza!G106","v":"0,3 l"},{"$f":"Baza!H106","v":1.78},{"$f":"Baza!I106","v":1.8690000000000002},null,0]
[null,null,null,{"$f":"Baza!D107","v":"gnk0720"},{"$f":"Baza!F107","v":"Sok świeży pomidor"},null,{"$f":"Baza!G107","v":"0,3 l"},{"$f":"Baza!H107","v":1.78},{"$f":"Baza!I107","v":1.8690000000000002},null,0]
[null,null,null,{"$f":"Baza!D108","v":"gnk0730"},{"$f":"Baza!F108","v":"Nektar czerwony grejpfrut"},null,{"$f":"Baza!G108","v":"0,3 l"},{"$f":"Baza!H108","v":1.78},{"$f":"Baza!I108","v":1.8690000000000002},null,0]
[null,null,null,{"$f":"Baza!D109","v":"gnk0760"},{"$f":"Baza!F109","v":"Sok pomarańczowy"},null,{"$f":"Baza!G109","v":"1 l"},{"$f":"Baza!H109","v":4.6500000000000004},{"$f":"Baza!I109","v":4.8825000000000003},null,0]
[null,null,null,{"$f":"Baza!D110","v":"gnk0770"},{"$f":"Baza!F110","v":"Sok jabłkowy"},null,{"$f":"Baza!G110","v":"1 l"},{"$f":"Baza!H110","v":3.58},{"$f":"Baza!I110","v":3.7590000000000003},null,0]
[null,null,null,{"$f":"Baza!D111","v":"gnk0780"},{"$f":"Baza!F111","v":"Nektar czarna porzeczka"},null,{"$f":"Baza!G111","v":"1 l"},{"$f":"Baza!H111","v":4.6500000000000004},{"$f":"Baza!I111","v":4.8825000000000003},null,0]
[null,null,null,{"$f":"Baza!D112","v":"gnk0790"},{"$f":"Baza!F112","v":"Sok 100% czerwony grejpfrut"},null,{"$f":"Baza!G112","v":"1 l"},{"$f":"Baza!H112","v":4.45},{"$f":"Baza!I112","v":4.6725000000000003},null,0]
[null,null,null,{"$f":"Baza!D113","v":"gnk0800"},{"$f":"Baza!F113","v":"Sok pomidorowy"},null,{"$f":"Baza!G113","v":"1 l"},{"$f":"Baza!H113","v":3.58},{"$f":"Baza!I113","v":3.7590000000000003},null,0]
[null,null,null,{"$f":"Baza!D114","v":"gnk0810"},{"$f":"Baza!F114","v":"Sok multiwitamina classic"},null,{"$f":"Baza!G114","v":"1 l"},{"$f":"Baza!H114","v":4.01},{"$f":"Baza!I114","v":4.2104999999999997},null,0]
[null,null,null,{"$f":"Baza!D115","v":"gnk0830"},{"$f":"Baza!F115","v":"Nektar z czerwony pomarańczy sycylijskich"},null,{"$f":"Baza!G115","v":"1 l"},{"$f":"Baza!H115","v":4.4400000000000004},{"$f":"Baza!I115","v":4.6620000000000008},null,0]
[null,{"$f":"Baza!B116","v":"Napoje gaz."},{"$f":"Baza!C116","v":"Coca-Cola"},{"$f":"Baza!D116","v":"gnk0040"},{"$f":"Baza!F116","v":"Zwykła"},null,{"$f":"Baza!G116","v":"0,5 l"},{"$f":"Baza!H116","v":3.04},{"$f":"Baza!I116","v":3.7391999999999999},null,0]
[null,null,null,{"$f":"Baza!D117","v":"gnk0070"},{"$f":"Baza!F117","v":"Zwykła"},null,{"$f":"Baza!G117","v":"1 l"},{"$f":"Baza!H117","v":3.98},{"$f":"Baza!I117","v":4.8953999999999995},null,0]
[null,null,null,{"$f":"Baza!D118","v":"gnk0060"},{"$f":"Baza!F118","v":"Zero"},null,{"$f":"Baza!G118","v":"0,5 l"},{"$f":"Baza!H118","v":3.04},{"$f":"Baza!I118","v":3.7391999999999999},null,0]
[null,null,null,{"$f":"Baza!D119","v":"gnk0090"},{"$f":"Baza!F119","v":"Zero"},null,{"$f":"Baza!G119","v":"1 l"},{"$f":"Baza!H119","v":3.98},{"$f":"Baza!I119","v":4.8953999999999995},null,0]
[null,null,null,{"$f":"Baza!D120","v":"gnk0050"},{"$f":"Baza!F120","v":"Light"},null,{"$f":"Baza!G120","v":"0,5 l"},{"$f":"Baza!H120","v":3.04},{"$f":"Baza!I120","v":3.7391999999999999},null,0]
[null,null,null,{"$f":"Baza!D121","v":"gnk0080"},{"$f":"Baza!F121","v":"Light"},null,{"$f":"Baza!G121","v":"1 l"},{"$f":"Baza!H121","v":3.63},{"$f":"Baza!I121","v":4.4649000000000001},null,0]
[]
[null,"Informacje dodatkowe",null,null,null,null,null,"WARTOŚĆ PRODUKTÓW",null,null,{"$f":"SUM(K8:K126)","v":0}]
[null,"  ",null,null,null,null,null,"Opłata za dostawę",null,null,{"$f":"IF(K128>=Main!F4,\"GRATIS\",Main!F3)","v":11}]
[null,null,null,null,null,null,null,{"$f":"IF(K128-Main!F4>=0,\"\",\"Do darmowej dostawy brakuje jeszcze \"&ABS(ROUND(K128-Main!F4,2))&\" zł\")","v":"Do darmowej dostawy brakuje jeszcze 300 zł"}]
[null,null,null,null,null,null,null,"Upominek do zamówienia",null,null,{"$f":"IF(K128>=Main!F8,\"\",\"Brak\")","v":"Brak"}]
[null,null,null,null,null,null,null,{"$f":"IF(K128-Main!F8>=0,Main!F7,\"Do otrzymania upominku brakuje jeszcze \"&ABS(ROUND(K128-Main!F8,2))&\" zł\")","v":"Do otrzymania upominku brakuje jeszcze 500 zł"}]
[]
[null,null,null,null,null,null,null,"Data zamówienia",null,null,{"$f":"TODAY()","v":"2016-08-26"}]
[null,null,null,null,null,null,null,"Przewidywany czas dostawy",null,null,{"$f":"WORKDAY(TODAY(),IF(F4=Main!C11,Main!F11,Main!F12),0)","v":"2016-08-29"}]
[]
[null,"Dane do przelewu: GAMAT s. c. W. Janiszewski, M. Janiszewska, ul.Koszykowa 35, 00-553 Warszawa, \nNr rachunku bankowego M bank: 26114020040000360233908699"]

{"sheet":"Drukuj","index":3,"n_rows":141,"n_cols":10,"rows_kept":141,"cut":false,"hidden":false,"merged":[[9,3,9,5],[10,3,10,5],[11,3,11,5],[12,3,12,5],[13,3,13,5],[14,3,14,5],[132,1,132,3],[21,3,21,5],[22,3,22,5],[23,3,23,5],[24,3,24,5],[25,3,25,5],[26,3,26,5],[27,3,27,5],[15,3,15,5],[16,3,16,5],[17,3,17,5],[18,3,18,5],[19,3,19,5],[20,3,20,5],[34,3,34,5],[35,3,35,5],[36,3,36,5],[37,3,37,5],[38,3,38,5],[39,3,39,5],[28,3,28,5],[29,3,29,5],[30,3,30,5],[31,3,31,5],[32,3,32,5],[33,3,33,5],[119,3,119,5],[118,3,118,5],[117,3,117,5],[116,3,116,5],[115,3,115,5],[114,3,114,5],[40,3,40,5],[107,3,107,5],[106,3,106,5],[105,3,105,5],[104,3,104,5],[103,3,103,5],[102,3,102,5],[113,3,113,5],[112,3,112,5],[111,3,111,5],[128,3,128,5],[127,3,127,5],[126,3,126,5],[125,3,125,5],[124,3,124,5],[123,3,123,5],[122,3,122,5],[121,3,121,5],[120,3,120,5],[86,3,86,5],[85,3,85,5],[84,3,84,5],[110,3,110,5],[109,3,109,5],[108,3,108,5],[95,3,95,5],[94,3,94,5],[93,3,93,5],[92,3,92,5],[91,3,91,5],[90,3,90,5],[101,3,101,5],[100,3,100,5],[99,3,99,5],[98,3,98,5],[97,3,97,5],[96,3,96,5],[56,3,56,5],[57,3,57,5],[58,3,58,5],[77,3,77,5],[76,3,76,5],[75,3,75,5],[74,3,74,5],[73,3,73,5],[72,3,72,5],[63,3,63,5],[62,3,62,5],[61,3,61,5],[60,3,60,5],[59,3,59,5],[64,3,64,5],[44,3,44,5],[43,3,43,5],[42,3,42,5],[41,3,41,5],[54,3,54,5],[55,3,55,5],[50,3,50,5],[49,3,49,5],[47,3,47,5],[46,3,46,5],[48,3,48,5],[53,3,53,5],[52,3,52,5],[51,3,51,5],[45,3,45,5],[134,1,134,9],[135,1,138,9],[140,1,141,9],[130,6,130,8],[132,6,132,8],[131,6,131,8],[130,1,130,3],[131,1,131,3],[65,3,65,5],[66,3,66,5],[67,3,67,5],[71,3,71,5],[70,3,70,5],[69,3,69,5],[68,3,68,5],[83,3,83,5],[82,3,82,5],[81,3,81,5],[80,3,80,5],[79,3,79,5],[78,3,78,5],[89,3,89,5],[88,3,88,5],[87,3,87,5],[6,7,7,9],[1,1,1,4],[7,1,7,4],[6,1,6,4],[3,1,3,4],[2,1,2,4],[4,1,4,4],[5,1,5,4],[1,6,1,9],[2,7,2,9],[3,7,3,9],[4,7,4,9],[5,7,5,9]]}
[]
[null,null,null,null,null,null,"Dane Zamawiającego"]
[null,"GAMAT s. c.",null,null,null,null,"NIP",{"$f":"GAMAT!F3","v":1234567890}]
[null,"W. Janiszewski, M. Janiszewska",null,null,null,null,"Miejscowość",{"$f":"GAMAT!F4","v":"Warszawa"}]
[null,"ul. Koszykowa 35",null,null,null,null,"Kod pocztowy",{"$f":"GAMAT!H3","v":12345}]
[null,"00-553 Warszawa",null,null,null,null,"Płatność",{"$f":"INDEX(GAMAT!$P$2:$P$4,GAMAT!$Q$2,1)","v":"Przelew"}]
[null,"Numer rachunku bankowego:",null,null,null,null,"Adres dostawy",{"$f":"GAMAT!H4","v":"  "}]
[null,"mBank 26-1140-2004-0000-3602-3390-8699"]
[]
[null,"Lp.","Symbol","Produkt",null,null,"Cena netto","Cena brutto","Ilość","Wartość brutto"]
[null,1,{"$f":"Baza!D3","v":"gkk0080"},{"$f":"Baza!E3","v":"Nescafe Gold 200 g"},null,null,{"$f":"Baza!H3","v":33.08},{"$f":"Baza!I3","v":40.688399999999994},{"$f":"GAMAT!J8","v":0},{"$f":"GAMAT!K8","v":0}]
[null,2,{"$f":"Baza!D4","v":"gkk0050"},{"$f":"Baza!E4","v":"Nescafe Creme Sensazione 200 g"},null,null,{"$f":"Baza!H4","v":19.88},{"$f":"Baza!I4","v":24.452399999999997},{"$f":"GAMAT!J9","v":0},{"$f":"GAMAT!K9","v":0}]
[null,3,{"$f":"Baza!D5","v":"gkk0030"},{"$f":"Baza!E5","v":"Nescafe Classic 200 g"},null,null,{"$f":"Baza!H5","v":18.41},{"$f":"Baza!I5","v":22.644300000000001},{"$f":"GAMAT!J10","v":0},{"$f":"GAMAT!K10","v":0}]
[null,4,{"$f":"Baza!D6","v":"gkk0060"},{"$f":"Baza!E6","v":"Nescafe Espresso Int. Puszka 100 g"},null,null,{"$f":"Baza!H6","v":22.45},{"$f":"Baza!I6","v":27.613499999999998},{"$f":"GAMAT!J11","v":0},{"$f":"GAMAT!K11","v":0}]
[null,5,{"$f":"Baza!D7","v":"gkk0210"},{"$f":"Baza!E7","v":"Jacobs Cronat Gold 200 g"},null,null,{"$f":"Baza!H7","v":20.329999999999998},{"$f":"Baza!I7","v":25.005899999999997},{"$f":"GAMAT!J12","v":0},{"$f":"GAMAT!K12","v":0}]
[null,6,{"$f":"Baza!D8","v":"gkk0200"},{"$f":"Baza!E8","v":"Tchibo Family Classic 250 g"},null,null,{"$f":"Baza!H8","v":6},{"$f":"Baza!I8","v":7.38},{"$f":"GAMAT!J13","v":0},{"$f":"GAMAT!K13","v":0}]
[null,7,{"$f":"Baza!D9","v":"gkk0140"},{"$f":"Baza!E9","v":"Lavazza Espresso 250 g"},null,null,{"$f":"Baza!H9","v":63},{"$f":"Baza!I9","v":77.489999999999995},{"$f":"GAMAT!J14","v":0},{"$f":"GAMAT!K14","v":0}]
[null,8,{"$f":"Baza!D10","v":"gkk0150"},{"$f":"Baza!E10","v":"Lavazza Qualita Rossa 250 g"},null,null,{"$f":"Baza!H10","v":13.69},{"$f":"Baza!I10","v":16.838699999999999},{"$f":"GAMAT!J15","v":0},{"$f":"GAMAT!K15","v":0}]
[null,9,{"$f":"Baza!D11","v":"gkk0120"},{"$f":"Baza!E11","v":"Lavazza Qualita Oro 250 g"},null,null,{"$f":"Baza!H11","v":15.75},{"$f":"Baza!I11","v":19.372499999999999},{"$f":"GAMAT!J16","v":0},{"$f":"GAMAT!K16","v":0}]
[null,10,{"$f":"Baza!D12","v":"gkk0130"},{"$f":"Baza!E12","v":"Lavazza Qualita Oro 250 g"},null,null,{"$f":"Baza!H12","v":18.38},{"$f":"Baza!I12","v":22.607399999999998},{"$f":"GAMAT!J17","v":0},{"$f":"GAMAT!K17","v":0}]
[null,11,{"$f":"Baza!D13","v":"gkk0140"},{"$f":"Baza!E13","v":"Lavazza Qualita Oro 1000 g"},null,null,{"$f":"Baza!H13","v":63},{"$f":"Baza!I13","v":77.489999999999995},{"$f":"GAMAT!J18","v":0},{"$f":"GAMAT!K18","v":0}]
[null,12,{"$f":"Baza!D14","v":"gkk0160"},{"$f":"Baza!E14","v":"Lavazza Qualita Rossa 1000 g"},null,null,{"$f":"Baza!H14","v":47.49},{"$f":"Baza!I14","v":58.412700000000001},{"$f":"GAMAT!J19","v":0},{"$f":"GAMAT!K19","v":0}]
[null,13,{"$f":"Baza!D15","v":"gkk0180"},{"$f":"Baza!E15","v":"Lavazza Grand Espresso 1000 g"},null,null,{"$f":"Baza!H15","v":61.69},{"$f":"Baza!I15","v":75.878699999999995},{"$f":"GAMAT!J20","v":0},{"$f":"GAMAT!K20","v":0}]
[null,14,{"$f":"Baza!D16","v":"gkk0190"},{"$f":"Baza!E16","v":"Lavazza Crema e Aroma 1000 g"},null,null,{"$f":"Baza!H16","v":47.49},{"$f":"Baza!I16","v":58.412700000000001},{"$f":"GAMAT!J21","v":0},{"$f":"GAMAT!K21","v":0}]
[null,15,{"$f":"Baza!D17","v":"ghk0160"},{"$f":"Baza!E17","v":"Lipton Yellow Label 100 tor."},null,null,{"$f":"Baza!H17","v":12.19},{"$f":"Baza!I17","v":14.993699999999999},{"$f":"GAMAT!J22","v":0},{"$f":"GAMAT!K22","v":0}]
[null,16,{"$f":"Baza!D18","v":"ghk0190"},{"$f":"Baza!E18","v":"Lipton Earl Grey 100 tor."},null,null,{"$f":"Baza!H18","v":22.83},{"$f":"Baza!I18","v":28.080899999999996},{"$f":"GAMAT!J23","v":0},{"$f":"GAMAT!K23","v":0}]
[null,17,{"$f":"Baza!D19","v":"ghk0250"},{"$f":"Baza!E19","v":"Lipton Yellow Label 100 kopert"},null,null,{"$f":"Baza!H19","v":35.33},{"$f":"Baza!I19","v":43.4559},{"$f":"GAMAT!J24","v":0},{"$f":"GAMAT!K24","v":0}]
[null,18,{"$f":"Baza!D20","v":"ghk0260"},{"$f":"Baza!E20","v":"Lipton Earl Grey 100 kopert"},null,null,{"$f":"Baza!H20","v":35.049999999999997},{"$f":"Baza!I20","v":43.111499999999992},{"$f":"GAMAT!J25","v":0},{"$f":"GAMAT!K25","v":0}]
[null,19,{"$f":"Baza!D21","v":"ghk0400"},{"$f":"Baza!E21","v":"Saga 50 tor."},null,null,{"$f":"Baza!H21","v":3.28},{"$f":"Baza!I21","v":4.0343999999999998},{"$f":"GAMAT!J26","v":0},{"$f":"GAMAT!K26","v":0}]
[null,20,{"$f":"Baza!D22","v":"ghk0410"},{"$f":"Baza!E22","v":"Saga 100 tor."},null,null,{"$f":"Baza!H22","v":5.94},{"$f":"Baza!I22","v":7.3062000000000005},{"$f":"GAMAT!J27","v":0},{"$f":"GAMAT!K27","v":0}]
[null,21,{"$f":"Baza!D23","v":"ghk0040"},{"$f":"Baza!E23","v":"Dilmah Ceylon Gold 100 tor."},null,null,{"$f":"Baza!H23","v":23.05},{"$f":"Baza!I23","v":28.351500000000001},{"$f":"GAMAT!J28","v":0},{"$f":"GAMAT!K28","v":0}]
[null,22,{"$f":"Baza!D24","v":"ghk0020"},{"$f":"Baza!E24","v":"Dilmah Premium Tea 100 tor. bez zawieszki"},null,null,{"$f":"Baza!H24","v":18.079999999999998},{"$f":"Baza!I24","v":22.238399999999999},{"$f":"GAMAT!J29","v":0},{"$f":"GAMAT!K29","v":0}]
[null,23,{"$f":"Baza!D25","v":"ghk0050"},{"$f":"Baza!E25","v":"Dilmah Earl Grey 100 tor. bez zawieszki"},null,null,{"$f":"Baza!H25","v":22.76},{"$f":"Baza!I25","v":27.994800000000001},{"$f":"GAMAT!J30","v":0},{"$f":"GAMAT!K30","v":0}]
[null,24,{"$f":"Baza!D26","v":"ghk0200"},{"$f":"Baza!E26","v":"Lipton miętowa 25 tor."},null,null,{"$f":"Baza!H26","v":4.74},{"$f":"Baza!I26","v":5.8302000000000005},{"$f":"GAMAT!J31","v":0},{"$f":"GAMAT!K31","v":0}]
[null,25,{"$f":"Baza!D27","v":"ghk0210"},{"$f":"Baza!E27","v":"Lipton cytrusowa 25 tor."},null,null,{"$f":"Baza!H27","v":4.6900000000000004},{"$f":"Baza!I27","v":5.7687000000000008},{"$f":"GAMAT!J32","v":0},{"$f":"GAMAT!K32","v":0}]
[null,26,{"$f":"Baza!D28","v":"ghk0220"},{"$f":"Baza!E28","v":"Lipton classic 25 tor."},null,null,{"$f":"Baza!H28","v":4.6900000000000004},{"$f":"Baza!I28","v":5.7687000000000008},{"$f":"GAMAT!J33","v":0},{"$f":"GAMAT!K33","v":0}]
[null,27,{"$f":"Baza!D29","v":"ghk0340"},{"$f":"Baza!E29","v":"Lipton Piramidka Gold Tea 20 szt"},null,null,{"$f":"Baza!H29","v":7.73},{"$f":"Baza!I29","v":9.5079000000000011},{"$f":"GAMAT!J34","v":0},{"$f":"GAMAT!K34","v":0}]
[null,28,{"$f":"Baza!D30","v":"ghk0350"},{"$f":"Baza!E30","v":"Lipton Piramidka White Raspberry 20 szt"},null,null,{"$f":"Baza!H30","v":6.78},{"$f":"Baza!I30","v":8.3393999999999995},{"$f":"GAMAT!J35","v":0},{"$f":"GAMAT!K35","v":0}]
[null,29,{"$f":"Baza!D31","v":"ghk0360"},{"$f":"Baza!E31","v":"Lipton Piramidka Cytryna 20 szt"},null,null,{"$f":"Baza!H31","v":6.78},{"$f":"Baza!I31","v":8.3393999999999995},{"$f":"GAMAT!J36","v":0},{"$f":"GAMAT!K36","v":0}]
[null,30,{"$f":"Baza!D32","v":"ghk0370"},{"$f":"Baza!E32","v":"Lipton Piramidka Owoce Leśne 20 szt"},null,null,{"$f":"Baza!H32","v":6.78},{"$f":"Baza!I32","v":8.3393999999999995},{"$f":"GAMAT!J37","v":0},{"$f":"GAMAT!K37","v":0}]
[null,31,{"$f":"Baza!D33","v":"ghk0380"},{"$f":"Baza!E33","v":"Lipton Piramidka Indones Sencha 20 szt"},null,null,{"$f":"Baza!H33","v":7.73},{"$f":"Baza!I33","v":9.5079000000000011},{"$f":"GAMAT!J38","v":0},{"$f":"GAMAT!K38","v":0}]
[null,32,{"$f":"Baza!D34","v":"ghk0390"},{"$f":"Baza!E34","v":"Lipton Piramidka Zielona Cytryna Melisa 20 szt"},null,null,{"$f":"Baza!H34","v":6.78},{"$f":"Baza!I34","v":8.3393999999999995},{"$f":"GAMAT!J39","v":0},{"$f":"GAMAT!K39","v":0}]
[null,33,{"$f":"Baza!D35","v":"ghk0280"},{"$f":"Baza!E35","v":"Lipton Green Tea Pure 25 kopert fol."},null,null,{"$f":"Baza!H35","v":10.34},{"$f":"Baza!I35","v":12.7182},{"$f":"GAMAT!J40","v":0},{"$f":"GAMAT!K40","v":0}]
[null,34,{"$f":"Baza!D36","v":"ghk0290"},{"$f":"Baza!E36","v":"Lipton Green Tea Mint 25 kopert fol."},null,null,{"$f":"Baza!H36","v":10.55},{"$f":"Baza!I36","v":12.976500000000001},{"$f":"GAMAT!J41","v":0},{"$f":"GAMAT!K41","v":0}]
[null,35,{"$f":"Baza!D37","v":"ghk0300"},{"$f":"Baza!E37","v":"Lipton Green Tea Citrus 25 kopert fol."},null,null,{"$f":"Baza!H37","v":10.45},{"$f":"Baza!I37","v":12.853499999999999},{"$f":"GAMAT!J42","v":0},{"$f":"GAMAT!K42","v":0}]
[null,36,{"$f":"Baza!D38","v":"ghk0310"},{"$f":"Baza!E38","v":"Lipton Green Tea Orient 25 kopert fol."},null,null,{"$f":"Baza!H38","v":10.34},{"$f":"Baza!I38","v":12.7182},{"$f":"GAMAT!J43","v":0},{"$f":"GAMAT!K43","v":0}]
[null,37,{"$f":"Baza!D39","v":"ghk0320"},{"$f":"Baza!E39","v":"Lipton Owocowa Fruit Influsion 25 kopert fol."},null,null,{"$f":"Baza!H39","v":11.95},{"$f":"Baza!I39","v":14.698499999999999},{"$f":"GAMAT!J44","v":0},{"$f":"GAMAT!K44","v":0}]
[null,38,{"$f":"Baza!D40","v":"ghk0330"},{"$f":"Baza!E40","v":"Lipton Vanilia 25 kopert fol."},null,null,{"$f":"Baza!H40","v":10.34},{"$f":"Baza!I40","v":12.7182},{"$f":"GAMAT!J45","v":0},{"$f":"GAMAT!K45","v":0}]
[null,39,{"$f":"Baza!D41","v":"ghk0230"},{"$f":"Baza!E41","v":"Lipton More Than One Tea 12 smaków - 180 kopert"},null,null,{"$f":"Baza!H41","v":81.58},{"$f":"Baza!I41","v":100.3434},{"$f":"GAMAT!J46","v":0},{"$f":"GAMAT!K46","v":0}]
[null,40,{"$f":"Baza!D42","v":"ghk0060"},{"$f":"Baza!E42","v":"Dilmah Jagody z Wanilią 20 tor."},null,null,{"$f":"Baza!H42","v":6.48},{"$f":"Baza!I42","v":7.9704000000000006},{"$f":"GAMAT!J47","v":0},{"$f":"GAMAT!K47","v":0}]
[null,41,{"$f":"Baza!D43","v":"ghk0070"},{"$f":"Baza!E43","v":"Dilmah Earl Grey 20 tor."},null,null,{"$f":"Baza!H43","v":6.48},{"$f":"Baza!I43","v":7.9704000000000006},{"$f":"GAMAT!J48","v":0},{"$f":"GAMAT!K48","v":0}]
[null,42,{"$f":"Baza!D44","v":"ghk0080"},{"$f":"Baza!E44","v":"Dilmah Cytryny 20 tor."},null,null,{"$f":"Baza!H44","v":6.48},{"$f":"Baza!I44","v":7.9704000000000006},{"$f":"GAMAT!J49","v":0},{"$f":"GAMAT!K49","v":0}]
[null,43,{"$f":"Baza!D45","v":"ghk0090"},{"$f":"Baza!E45","v":"Dilmah Maliny 20 tor."},null,null,{"$f":"Baza!H45","v":6.48},{"$f":"Baza!I45","v":7.9704000000000006},{"$f":"GAMAT!J50","v":0},{"$f":"GAMAT!K50","v":0}]
[null,44,{"$f":"Baza!D46","v":"ghk0100"},{"$f":"Baza!E46","v":"Dilmah Wanilia 20 tor."},null,null,{"$f":"Baza!H46","v":6.48},{"$f":"Baza!I46","v":7.9704000000000006},{"$f":"GAMAT!J51","v":0},{"$f":"GAMAT!K51","v":0}]
[null,45,{"$f":"Baza!D47","v":"ghk0110"},{"$f":"Baza!E47","v":"Dilmah Mango z Truskawką 20 tor."},null,null,{"$f":"Baza!H47","v":6.48},{"$f":"Baza!I47","v":7.9704000000000006},{"$f":"GAMAT!J52","v":0},{"$f":"GAMAT!K52","v":0}]
[null,46,{"$f":"Baza!D48","v":"ghk0140"},{"$f":"Baza!E48","v":"Dilmah Pick mix 12 czarnych gatunków - 240 kopert"},null,null,{"$f":"Baza!H48","v":120.13},{"$f":"Baza!I48","v":147.75989999999999},{"$f":"GAMAT!J53","v":0},{"$f":"GAMAT!K53","v":0}]
[null,47,{"$f":"Baza!D49","v":"gck0010"},{"$f":"Baza!E49","v":"Diamant sypki biały 1 kg"},null,null,{"$f":"Baza!H49","v":4.33},{"$f":"Baza!I49","v":4.6764000000000001},{"$f":"GAMAT!J54","v":0},{"$f":"GAMAT!K54","v":0}]
[null,48,{"$f":"Baza!D50","v":"gck0160"},{"$f":"Baza!E50","v":"Diamant w kostkach biały 0,5 kg"},null,null,{"$f":"Baza!H50","v":3.76},{"$f":"Baza!I50","v":4.0608000000000004},{"$f":"GAMAT!J55","v":0},{"$f":"GAMAT!K55","v":0}]
[null,49,{"$f":"Baza!D51","v":"gnk0550"},{"$f":"Baza!E51","v":"Łaciate 0,5% 0,5 litra"},null,null,{"$f":"Baza!H51","v":1.46},{"$f":"Baza!I51","v":1.5329999999999999},{"$f":"GAMAT!J56","v":0},{"$f":"GAMAT!K56","v":0}]
[null,50,{"$f":"Baza!D52","v":"gnk0540"},{"$f":"Baza!E52","v":"Łaciate 0,5% 1 litr"},null,null,{"$f":"Baza!H52","v":2.5299999999999998},{"$f":"Baza!I52","v":2.6564999999999999},{"$f":"GAMAT!J57","v":0},{"$f":"GAMAT!K57","v":0}]
[null,51,{"$f":"Baza!D53","v":"gnk0440"},{"$f":"Baza!E53","v":"Łaciate 2% 0,5 litra"},null,null,{"$f":"Baza!H53","v":1.58},{"$f":"Baza!I53","v":1.6590000000000003},{"$f":"GAMAT!J58","v":0},{"$f":"GAMAT!K58","v":0}]
[null,52,{"$f":"Baza!D54","v":"gnk0430"},{"$f":"Baza!E54","v":"Łaciate 2% 1 litr"},null,null,{"$f":"Baza!H54","v":2.7},{"$f":"Baza!I54","v":2.8350000000000004},{"$f":"GAMAT!J59","v":0},{"$f":"GAMAT!K59","v":0}]
[null,53,{"$f":"Baza!D55","v":"gnk0420"},{"$f":"Baza!E55","v":"Łaciate 3,2% 0,5 litra"},null,null,{"$f":"Baza!H55","v":1.61},{"$f":"Baza!I55","v":1.6905000000000001},{"$f":"GAMAT!J60","v":0},{"$f":"GAMAT!K60","v":0}]
[null,54,{"$f":"Baza!D56","v":"gnk0410"},{"$f":"Baza!E56","v":"Łaciate 3,2% 1 litr"},null,null,{"$f":"Baza!H56","v":2.86},{"$f":"Baza!I56","v":3.0030000000000001},{"$f":"GAMAT!J61","v":0},{"$f":"GAMAT!K61","v":0}]
[null,55,{"$f":"Baza!D57","v":"gnk0560"},{"$f":"Baza!E57","v":"Łaciate zagęszczone niesłodzone 7,5% 0,25 litra"},null,null,{"$f":"Baza!H57","v":1.68},{"$f":"Baza!I57","v":1.764},{"$f":"GAMAT!J62","v":0},{"$f":"GAMAT!K62","v":0}]
[null,56,{"$f":"Baza!D58","v":"gnk0570"},{"$f":"Baza!E58","v":"Łaciate zagęszczone niesłodzone 7,5% 0,5 litra"},null,null,{"$f":"Baza!H58","v":2.79},{"$f":"Baza!I58","v":2.9295},{"$f":"GAMAT!J63","v":0},{"$f":"GAMAT!K63","v":0}]
[null,57,{"$f":"Baza!D59","v":"gnk0460"},{"$f":"Baza!E59","v":"Gostyń zagęszczone niesłodzone Light 4 % 0,5 litra"},null,null,{"$f":"Baza!H59","v":4.04},{"$f":"Baza!I59","v":4.242},{"$f":"GAMAT!J64","v":0},{"$f":"GAMAT!K64","v":0}]
[null,58,{"$f":"Baza!D60","v":"gnk0450"},{"$f":"Baza!E60","v":"Gostyń zagęszczone niesłodzone 7,5% 0,5 litra"},null,null,{"$f":"Baza!H60","v":4.01},{"$f":"Baza!I60","v":4.2104999999999997},{"$f":"GAMAT!J65","v":0},{"$f":"GAMAT!K65","v":0}]
[null,59,{"$f":"Baza!D61","v":"gnk0510"},{"$f":"Baza!E61","v":"Łaciate śmietanka 10 ml x 10 szt"},null,null,{"$f":"Baza!H61","v":1.1299999999999999},{"$f":"Baza!I61","v":1.1864999999999999},{"$f":"GAMAT!J66","v":0},{"$f":"GAMAT!K66","v":0}]
[null,60,{"$f":"Baza!D62","v":"gnk0490"},{"$f":"Baza!E62","v":"Champion cytrynka 100% sok 7,5 g x 10 szt"},null,null,{"$f":"Baza!H62","v":1.6},{"$f":"Baza!I62","v":1.6800000000000002},{"$f":"GAMAT!J67","v":0},{"$f":"GAMAT!K67","v":0}]
[null,61,{"$f":"Baza!D63","v":"gnk0600"},{"$f":"Baza!E63","v":"Cisowianka 0,5 litra"},null,null,{"$f":"Baza!H63","v":0.83},{"$f":"Baza!I63","v":1.0208999999999999},{"$f":"GAMAT!J68","v":0},{"$f":"GAMAT!K68","v":0}]
[null,62,{"$f":"Baza!D64","v":"gnk0610"},{"$f":"Baza!E64","v":"Cisowianka 1,5 litra"},null,null,{"$f":"Baza!H64","v":1.18},{"$f":"Baza!I64","v":1.4513999999999998},{"$f":"GAMAT!J69","v":0},{"$f":"GAMAT!K69","v":0}]
[null,63,{"$f":"Baza!D65","v":"gnk0850"},{"$f":"Baza!E65","v":"Cisowianka 0,3 litra but. Szklana"},null,null,{"$f":"Baza!H65","v":1.35},{"$f":"Baza!I65","v":1.6605000000000001},{"$f":"GAMAT!J70","v":0},{"$f":"GAMAT!K70","v":0}]
[null,64,{"$f":"Baza!D66","v":"gnk0870"},{"$f":"Baza!E66","v":"Cisowianka 0,7 litra but. Szklana"},null,null,{"$f":"Baza!H66","v":2.2400000000000002},{"$f":"Baza!I66","v":2.7552000000000003},{"$f":"GAMAT!J71","v":0},{"$f":"GAMAT!K71","v":0}]
[null,65,{"$f":"Baza!D67","v":"gnk0250"},{"$f":"Baza!E67","v":"Nałęczowianka 0,5 litra"},null,null,{"$f":"Baza!H67","v":1.05},{"$f":"Baza!I67","v":1.2915000000000001},{"$f":"GAMAT!J72","v":0},{"$f":"GAMAT!K72","v":0}]
[null,66,{"$f":"Baza!D68","v":"gnk0240"},{"$f":"Baza!E68","v":"Nałęczowianka 1,5 litra"},null,null,{"$f":"Baza!H68","v":1.31},{"$f":"Baza!I68","v":1.6113},{"$f":"GAMAT!J73","v":0},{"$f":"GAMAT!K73","v":0}]
[null,67,{"$f":"Baza!D69","v":"gnk0640"},{"$f":"Baza!E69","v":"Żywiec Zdrój 0,5 litra"},null,null,{"$f":"Baza!H69","v":1.26},{"$f":"Baza!I69","v":1.5498000000000001},{"$f":"GAMAT!J74","v":0},{"$f":"GAMAT!K74","v":0}]
[null,68,{"$f":"Baza!D70","v":"gnk0650"},{"$f":"Baza!E70","v":"Żywiec Zdrój 1,5 litra"},null,null,{"$f":"Baza!H70","v":1.64},{"$f":"Baza!I70","v":2.0171999999999999},{"$f":"GAMAT!J75","v":0},{"$f":"GAMAT!K75","v":0}]
[null,69,{"$f":"Baza!D71","v":"gnk0160"},{"$f":"Baza!E71","v":"Kropla Beskidu 0,25 litra but. Szklana"},null,null,{"$f":"Baza!H71","v":1.23},{"$f":"Baza!I71","v":1.5128999999999999},{"$f":"GAMAT!J76","v":0},{"$f":"GAMAT!K76","v":0}]
[null,70,{"$f":"Baza!D72","v":"gnk0180"},{"$f":"Baza!E72","v":"Kropla Beskidu 0,5 litra"},null,null,{"$f":"Baza!H72","v":1.55},{"$f":"Baza!I72","v":1.9065000000000001},{"$f":"GAMAT!J77","v":0},{"$f":"GAMAT!K77","v":0}]
[null,71,{"$f":"Baza!D73","v":"gnk0200"},{"$f":"Baza!E73","v":"Kropla Beskidu 1,75 litra"},null,null,{"$f":"Baza!H73","v":1.9},{"$f":"Baza!I73","v":2.3369999999999997},{"$f":"GAMAT!J78","v":0},{"$f":"GAMAT!K78","v":0}]
[null,72,{"$f":"Baza!D74","v":"gnk0840"},{"$f":"Baza!E74","v":"Cisowianka 0,5 litra"},null,null,{"$f":"Baza!H74","v":0.83},{"$f":"Baza!I74","v":1.0208999999999999},{"$f":"GAMAT!J79","v":0},{"$f":"GAMAT!K79","v":0}]
[null,73,{"$f":"Baza!D75","v":"gnk0611"},{"$f":"Baza!E75","v":"Cisowianka 1,5 litra"},null,null,{"$f":"Baza!H75","v":1.18},{"$f":"Baza!I75","v":1.4513999999999998},{"$f":"GAMAT!J80","v":0},{"$f":"GAMAT!K80","v":0}]
[null,74,{"$f":"Baza!D76","v":"gnk0900"},{"$f":"Baza!E76","v":"Cisowianka musująca Parlage 0,7 litra"},null,null,{"$f":"Baza!H76","v":1.21},{"$f":"Baza!I76","v":1.4883},{"$f":"GAMAT!J81","v":0},{"$f":"GAMAT!K81","v":0}]
[null,75,{"$f":"Baza!D77","v":"gnk0860"},{"$f":"Baza!E77","v":"Cisowianka musująca Parlage 0,3 litra but. Szklana"},null,null,{"$f":"Baza!H77","v":1.54},{"$f":"Baza!I77","v":1.8942000000000001},{"$f":"GAMAT!J82","v":0},{"$f":"GAMAT!K82","v":0}]
[null,76,{"$f":"Baza!D78","v":"gnk0880"},{"$f":"Baza!E78","v":"Cisowianka musująca Parlage 0,7 litra but. Szklana"},null,null,{"$f":"Baza!H78","v":2.36},{"$f":"Baza!I78","v":2.9027999999999996},{"$f":"GAMAT!J83","v":0},{"$f":"GAMAT!K83","v":0}]
[null,77,{"$f":"Baza!D79","v":"gnk0660"},{"$f":"Baza!E79","v":"Muszynianka niskonasycona 0,6 litra"},null,null,{"$f":"Baza!H79","v":1.29},{"$f":"Baza!I79","v":1.5867},{"$f":"GAMAT!J84","v":0},{"$f":"GAMAT!K84","v":0}]
[null,78,{"$f":"Baza!D80","v":"gnk0670"},{"$f":"Baza!E80","v":"Muszynianka niskonasycona 1,5 litra"},null,null,{"$f":"Baza!H80","v":1.69},{"$f":"Baza!I80","v":2.0787},{"$f":"GAMAT!J85","v":0},{"$f":"GAMAT!K85","v":0}]
[null,79,{"$f":"Baza!D81","v":"gnk0680"},{"$f":"Baza!E81","v":"Muszynianka średnionasycona (niebieska) 1,5 litra"},null,null,{"$f":"Baza!H81","v":1.66},{"$f":"Baza!I81","v":2.0417999999999998},{"$f":"GAMAT!J86","v":0},{"$f":"GAMAT!K86","v":0}]
[null,80,{"$f":"Baza!D82","v":"gnk0580"},{"$f":"Baza!E82","v":"Cisowianka 0,5 litra"},null,null,{"$f":"Baza!H82","v":0.83},{"$f":"Baza!I82","v":1.0208999999999999},{"$f":"GAMAT!J87","v":0},{"$f":"GAMAT!K87","v":0}]
[null,81,{"$f":"Baza!D83","v":"gnk0590"},{"$f":"Baza!E83","v":"Cisowianka 1,5 litra"},null,null,{"$f":"Baza!H83","v":1.18},{"$f":"Baza!I83","v":1.4513999999999998},{"$f":"GAMAT!J88","v":0},{"$f":"GAMAT!K88","v":0}]
[null,82,{"$f":"Baza!D84","v":"gnk0861"},{"$f":"Baza!E84","v":"Cisowianka silnie gazowana 0,3 litra but. Szklana"},null,null,{"$f":"Baza!H84","v":1.3},{"$f":"Baza!I84","v":1.599},{"$f":"GAMAT!J89","v":0},{"$f":"GAMAT!K89","v":0}]
[null,83,{"$f":"Baza!D85","v":"gnk0862"},{"$f":"Baza!E85","v":"Cisowianka silnie gazowana 0,7 litra but. Szklana"},null,null,{"$f":"Baza!H85","v":1.93},{"$f":"Baza!I85","v":2.3738999999999999},{"$f":"GAMAT!J90","v":0},{"$f":"GAMAT!K90","v":0}]
[null,84,{"$f":"Baza!D86","v":"gnk0230"},{"$f":"Baza!E86","v":"Nalęczowianka 0,5 litra"},null,null,{"$f":"Baza!H86","v":1.05},{"$f":"Baza!I86","v":1.2915000000000001},{"$f":"GAMAT!J91","v":0},{"$f":"GAMAT!K91","v":0}]
[null,85,{"$f":"Baza!D87","v":"gnk0220"},{"$f":"Baza!E87","v":"Nalęczowianka 1,5 litra"},null,null,{"$f":"Baza!H87","v":1.31},{"$f":"Baza!I87","v":1.6113},{"$f":"GAMAT!J92","v":0},{"$f":"GAMAT!K92","v":0}]
[null,86,{"$f":"Baza!D88","v":"gnk0620"},{"$f":"Baza!E88","v":"Żywiec Zdrój 0,5 litra"},null,null,{"$f":"Baza!H88","v":1.26},{"$f":"Baza!I88","v":1.5498000000000001},{"$f":"GAMAT!J93","v":0},{"$f":"GAMAT!K93","v":0}]
[null,87,{"$f":"Baza!D89","v":"gnk0630"},{"$f":"Baza!E89","v":"Żywiec Zdrój 1,5 litra"},null,null,{"$f":"Baza!H89","v":1.64},{"$f":"Baza!I89","v":2.0171999999999999},{"$f":"GAMAT!J94","v":0},{"$f":"GAMAT!K94","v":0}]
[null,88,{"$f":"Baza!D90","v":"gnk0170"},{"$f":"Baza!E90","v":"Kropla Beskidu 0,25 litra but. Szklana"},null,null,{"$f":"Baza!H90","v":1.23},{"$f":"Baza!I90","v":1.5128999999999999},{"$f":"GAMAT!J95","v":0},{"$f":"GAMAT!K95","v":0}]
[null,89,{"$f":"Baza!D91","v":"gnk0190"},{"$f":"Baza!E91","v":"Kropla Beskidu 0,5 litra"},null,null,{"$f":"Baza!H91","v":1.55},{"$f":"Baza!I91","v":1.9065000000000001},{"$f":"GAMAT!J96","v":0},{"$f":"GAMAT!K96","v":0}]
[null,90,{"$f":"Baza!D92","v":"gnk0210"},{"$f":"Baza!E92","v":"Kropla Beskidu 1,75 litra"},null,null,{"$f":"Baza!H92","v":1.9},{"$f":"Baza!I92","v":2.3369999999999997},{"$f":"GAMAT!J97","v":0},{"$f":"GAMAT!K97","v":0}]
[null,91,{"$f":"Baza!D93","v":"gnk0280"},{"$f":"Baza!E93","v":"Cytrynowa"},null,null,{"$f":"Baza!H93","v":2.86},{"$f":"Baza!I93","v":3.5177999999999998},{"$f":"GAMAT!J98","v":0},{"$f":"GAMAT!K98","v":0}]
[null,92,{"$f":"Baza!D94","v":"gnk0290"},{"$f":"Baza!E94","v":"Brzoskwiniowa"},null,null,{"$f":"Baza!H94","v":2.86},{"$f":"Baza!I94","v":3.5177999999999998},{"$f":"GAMAT!J99","v":0},{"$f":"GAMAT!K99","v":0}]
[null,93,{"$f":"Baza!D95","v":"gnk0300"},{"$f":"Baza!E95","v":"Zielono-cytrynowa"},null,null,{"$f":"Baza!H95","v":2.79},{"$f":"Baza!I95","v":3.4317000000000002},{"$f":"GAMAT!J100","v":0},{"$f":"GAMAT!K100","v":0}]
[null,94,{"$f":"Baza!D96","v":"gnk0310"},{"$f":"Baza!E96","v":"Sok 100% pomarańczowy 0,33 litra"},null,null,{"$f":"Baza!H96","v":2.41},{"$f":"Baza!I96","v":2.5305000000000004},{"$f":"GAMAT!J101","v":0},{"$f":"GAMAT!K101","v":0}]
[null,95,{"$f":"Baza!D97","v":"gnk0320"},{"$f":"Baza!E97","v":"Sok 100% jabłkowy 0,33 litra"},null,null,{"$f":"Baza!H97","v":2.41},{"$f":"Baza!I97","v":2.5305000000000004},{"$f":"GAMAT!J102","v":0},{"$f":"GAMAT!K102","v":0}]
[null,96,{"$f":"Baza!D98","v":"gnk0340"},{"$f":"Baza!E98","v":"Sok multiwitamina 0,33 litra"},null,null,{"$f":"Baza!H98","v":2.41},{"$f":"Baza!I98","v":2.5305000000000004},{"$f":"GAMAT!J103","v":0},{"$f":"GAMAT!K103","v":0}]
[null,97,{"$f":"Baza!D99","v":"gnk0350"},{"$f":"Baza!E99","v":"Sok 100% pomarańczowy 1 litr"},null,null,{"$f":"Baza!H99","v":5.39},{"$f":"Baza!I99","v":5.6594999999999995},{"$f":"GAMAT!J104","v":0},{"$f":"GAMAT!K104","v":0}]
[null,98,{"$f":"Baza!D100","v":"gnk0360"},{"$f":"Baza!E100","v":"Sok cała pomarańcza 1 litr"},null,null,{"$f":"Baza!H100","v":6.14},{"$f":"Baza!I100","v":6.4470000000000001},{"$f":"GAMAT!J105","v":0},{"$f":"GAMAT!K105","v":0}]
[null,99,{"$f":"Baza!D101","v":"gnk0370"},{"$f":"Baza!E101","v":"Sok 100% jabłkowy 1 litr"},null,null,{"$f":"Baza!H101","v":4.1500000000000004},{"$f":"Baza!I101","v":4.3575000000000008},{"$f":"GAMAT!J106","v":0},{"$f":"GAMAT!K106","v":0}]
[null,100,{"$f":"Baza!D102","v":"gnk0380"},{"$f":"Baza!E102","v":"Sok czarna porzeczka 1 litr"},null,null,{"$f":"Baza!H102","v":5.24},{"$f":"Baza!I102","v":5.5020000000000007},{"$f":"GAMAT!J107","v":0},{"$f":"GAMAT!K107","v":0}]
[null,101,{"$f":"Baza!D103","v":"gnk0390"},{"$f":"Baza!E103","v":"Sok grejpfrutowy 1 litr"},null,null,{"$f":"Baza!H103","v":5.03},{"$f":"Baza!I103","v":5.2815000000000003},{"$f":"GAMAT!J108","v":0},{"$f":"GAMAT!K108","v":0}]
[null,102,{"$f":"Baza!D104","v":"gnk0690"},{"$f":"Baza!E104","v":"Sok pomarańczowy 0,3 litra"},null,null,{"$f":"Baza!H104","v":1.78},{"$f":"Baza!I104","v":1.8690000000000002},{"$f":"GAMAT!J109","v":0},{"$f":"GAMAT!K109","v":0}]
[null,103,{"$f":"Baza!D105","v":"gnk0700"},{"$f":"Baza!E105","v":"Sok jabłkowy 0,3 litra"},null,null,{"$f":"Baza!H105","v":1.78},{"$f":"Baza!I105","v":1.8690000000000002},{"$f":"GAMAT!J110","v":0},{"$f":"GAMAT!K110","v":0}]
[null,104,{"$f":"Baza!D106","v":"gnk0710"},{"$f":"Baza!E106","v":"Nekrat czarna porzeczka 0,3 litra"},null,null,{"$f":"Baza!H106","v":1.78},{"$f":"Baza!I106","v":1.8690000000000002},{"$f":"GAMAT!J111","v":0},{"$f":"GAMAT!K111","v":0}]
[null,105,{"$f":"Baza!D107","v":"gnk0720"},{"$f":"Baza!E107","v":"Sok świeży pomidor 0,3 litra"},null,null,{"$f":"Baza!H107","v":1.78},{"$f":"Baza!I107","v":1.8690000000000002},{"$f":"GAMAT!J112","v":0},{"$f":"GAMAT!K112","v":0}]
[null,106,{"$f":"Baza!D108","v":"gnk0730"},{"$f":"Baza!E108","v":"Nektar czerwony grejpfrut 0,3 litra"},null,null,{"$f":"Baza!H108","v":1.78},{"$f":"Baza!I108","v":1.8690000000000002},{"$f":"GAMAT!J113","v":0},{"$f":"GAMAT!K113","v":0}]
[null,107,{"$f":"Baza!D109","v":"gnk0760"},{"$f":"Baza!E109","v":"Sok pomarańczowy 1 Litr "},null,null,{"$f":"Baza!H109","v":4.6500000000000004},{"$f":"Baza!I109","v":4.8825000000000003},{"$f":"GAMAT!J114","v":0},{"$f":"GAMAT!K114","v":0}]
[null,108,{"$f":"Baza!D110","v":"gnk0770"},{"$f":"Baza!E110","v":"Sok jabłkowy 1 Litr"},null,null,{"$f":"Baza!H110","v":3.58},{"$f":"Baza!I110","v":3.7590000000000003},{"$f":"GAMAT!J115","v":0},{"$f":"GAMAT!K115","v":0}]
[null,109,{"$f":"Baza!D111","v":"gnk0780"},{"$f":"Baza!E111","v":"Nektar czarna porzeczka 1 Litr"},null,null,{"$f":"Baza!H111","v":4.6500000000000004},{"$f":"Baza!I111","v":4.8825000000000003},{"$f":"GAMAT!J116","v":0},{"$f":"GAMAT!K116","v":0}]
[null,110,{"$f":"Baza!D112","v":"gnk0790"},{"$f":"Baza!E112","v":"Sok 100% czerwony grejpfrut 1 Litr "},null,null,{"$f":"Baza!H112","v":4.45},{"$f":"Baza!I112","v":4.6725000000000003},{"$f":"GAMAT!J117","v":0},{"$f":"GAMAT!K117","v":0}]
[null,111,{"$f":"Baza!D113","v":"gnk0800"},{"$f":"Baza!E113","v":"Sok pomidorowy 1 Litr"},null,null,{"$f":"Baza!H113","v":3.58},{"$f":"Baza!I113","v":3.7590000000000003},{"$f":"GAMAT!J118","v":0},{"$f":"GAMAT!K118","v":0}]
[null,112,{"$f":"Baza!D114","v":"gnk0810"},{"$f":"Baza!E114","v":"Sok multiwitamina classic 1 Litra"},null,null,{"$f":"Baza!H114","v":4.01},{"$f":"Baza!I114","v":4.2104999999999997},{"$f":"GAMAT!J119","v":0},{"$f":"GAMAT!K119","v":0}]
[null,113,{"$f":"Baza!D115","v":"gnk0830"},{"$f":"Baza!E115","v":"Nektar z czerwony pomarańczy sycylijskich 1 litr"},null,null,{"$f":"Baza!H115","v":4.4400000000000004},{"$f":"Baza!I115","v":4.6620000000000008},{"$f":"GAMAT!J120","v":0},{"$f":"GAMAT!K120","v":0}]
[null,114,{"$f":"Baza!D116","v":"gnk0040"},{"$f":"Baza!E116","v":"Zwykła 0,5 Litra"},null,null,{"$f":"Baza!H116","v":3.04},{"$f":"Baza!I116","v":3.7391999999999999},{"$f":"GAMAT!J121","v":0},{"$f":"GAMAT!K121","v":0}]
[null,115,{"$f":"Baza!D117","v":"gnk0070"},{"$f":"Baza!E117","v":"Zwykła 1,0 Litr"},null,null,{"$f":"Baza!H117","v":3.98},{"$f":"Baza!I117","v":4.8953999999999995},{"$f":"GAMAT!J122","v":0},{"$f":"GAMAT!K122","v":0}]
[null,116,{"$f":"Baza!D118","v":"gnk0060"},{"$f":"Baza!E118","v":"Zero 0,5 Litra"},null,null,{"$f":"Baza!H118","v":3.04},{"$f":"Baza!I118","v":3.7391999999999999},{"$f":"GAMAT!J123","v":0},{"$f":"GAMAT!K123","v":0}]
[null,117,{"$f":"Baza!D119","v":"gnk0090"},{"$f":"Baza!E119","v":"Zero 1,0 Litr"},null,null,{"$f":"Baza!H119","v":3.98},{"$f":"Baza!I119","v":4.8953999999999995},{"$f":"GAMAT!J124","v":0},{"$f":"GAMAT!K124","v":0}]
[null,118,{"$f":"Baza!D120","v":"gnk0050"},{"$f":"Baza!E120","v":"Light 0,5 Litra"},null,null,{"$f":"Baza!H120","v":3.04},{"$f":"Baza!I120","v":3.7391999999999999},{"$f":"GAMAT!J125","v":0},{"$f":"GAMAT!K125","v":0}]
[null,119,{"$f":"Baza!D121","v":"gnk0080"},{"$f":"Baza!E121","v":"Light 1,0 Litr"},null,null,{"$f":"Baza!H121","v":3.63},{"$f":"Baza!I121","v":4.4649000000000001},{"$f":"GAMAT!J126","v":0},{"$f":"GAMAT!K126","v":0}]
[]
[null,"Data zamówienia",null,null,{"$f":"GAMAT!K134","v":"2016-08-26"},null,"Wartość produktów",null,null,{"$f":"GAMAT!K128","v":0}]
[null,"Przewidywany czas dostawy",null,null,{"$f":"GAMAT!K135","v":"2016-08-29"},null,"Opłata za dostawę",null,null,{"$f":"IF(GAMAT!K129=\"GRATIS\",\"GRATIS\",Main!F3)","v":11}]
[null,"Upominek",null,null,{"$f":"IF(GAMAT!K131=\"Brak\",\"Nie\",\"Tak\")","v":"Nie"},null,"Wartość zamówienia",null,null,{"$f":"IF(J131=0,0,J131+IF(J132=\"GRATIS\",0,J132))","v":0}]
[]
[null,"Informacje od klienta"]
[null,{"$f":"GAMAT!B129","v":"  "}]
[]
[]
[]
[]
[null,"Dane do przelewu: GAMAT s. c. W. Janiszewska, M. Janiszewska, ul.Koszykowa 35, 00-553 Warszawa, \nNr rachunku bankowego M bank: 26114020040000360233908699"]